Eroare chest review

Înainte de a posta o problemă, caută în acest forum și poate găsești rezolvare.
Închis
Avatar utilizator
xKratos
Ţepar / Untrusted User

Ţepar / Untrusted User
Mesaje: 381
Membru din: 15 Ian 2020, 18:04
Regat: Chunjo
Aprecieri: 116  
Mulţumiri: 2005  
Discord: Copiază ID
 Contact:
Medalii

*Problemă/Întrebare:
Tipologie server:
*Resursă folosită: Chest review by zenu
*ServerFiles utilizat:
*Syserr:
Poză:
*Detalii: Cred ca am gresit ceva ca am eroarea asta in sursa game

item_manager.cpp: In member function 'void ITEM_MANAGER::GetChestItemList(DWORD, std::vector<SC hestDropInfoTable, std::allocator<SChestDropInfoTable> >&)':
item_manager.cpp:1809: error: 'const class CSpecialItemGroup' has no member named 'GetGroupSize '
gmake: *** [OBJDIR/item_manager.o] Error 1
root@localhost:/usr/src/honor2/Srcs/Server/game/src #

[ Postat de pe iPhone ] Imagine
Afișează semnătura
Avatar utilizator
Athero
Ţepar / Untrusted User

Ţepar / Untrusted User
Mesaje: 3936
Membru din: 17 Aug 2017, 00:08
Aprecieri: 559  
Mulţumiri: 7142  
Discord: Copiază ID
Medalii

Vaynz scrie: ↑17 Mar 2020, 09:57 GetGroupSize nu ai asta in binary ia si tu dintr-un alt sv asta.
Fara suparare dar, e total gresit.

Iti lipseste din item_manager.h functia.
Cauta in oricare sursa de la martysama, ar trebui sa le aibe.

Intra in item_manager.h si cauta:
DWORD GetAttrVnum(DWORD dwVnum) const
{
............
}
sub asta adaugi
// Group의 Size를 return해준다.
int GetGroupSize() const
{
return m_vecProbs.size();
}

[ Postat de pe Android ] Imagine
//retras
Afișează semnătura
Avatar utilizator
xKratos
Ţepar / Untrusted User

Ţepar / Untrusted User
Mesaje: 381
Membru din: 15 Ian 2020, 18:04
Regat: Chunjo
Aprecieri: 116  
Mulţumiri: 2005  
Discord: Copiază ID
 Contact:
Medalii

Athero scrie: ↑17 Mar 2020, 10:01
Vaynz scrie: ↑17 Mar 2020, 09:57 GetGroupSize nu ai asta in binary ia si tu dintr-un alt sv asta.
Fara suparare dar, e total gresit.

Iti lipseste din item_manager.h functia.
Cauta in oricare sursa de la martysama, ar trebui sa le aibe.

Intra in item_manager.h si cauta:
DWORD GetAttrVnum(DWORD dwVnum) const
{
............
}
sub asta adaugi
// Group의 Size를 return해준다.
int GetGroupSize() const
{
return m_vecProbs.size();
}

[ Postat de pe Android ] Imagine
nu imi gaseste DWORD GetAttrVnum(DWORD dwVnum) const
Afișează semnătura
Avatar utilizator
Athero
Ţepar / Untrusted User

Ţepar / Untrusted User
Mesaje: 3936
Membru din: 17 Aug 2017, 00:08
Aprecieri: 559  
Mulţumiri: 7142  
Discord: Copiază ID
Medalii

Lirium scrie: ↑17 Mar 2020, 10:09
Athero scrie: ↑17 Mar 2020, 10:01
Vaynz scrie: ↑17 Mar 2020, 09:57 GetGroupSize nu ai asta in binary ia si tu dintr-un alt sv asta.
Fara suparare dar, e total gresit.

Iti lipseste din item_manager.h functia.
Cauta in oricare sursa de la martysama, ar trebui sa le aibe.

Intra in item_manager.h si cauta:
DWORD GetAttrVnum(DWORD dwVnum) const
{
............
}
sub asta adaugi
// Group의 Size를 return해준다.
int GetGroupSize() const
{
return m_vecProbs.size();
}

[ Postat de pe Android ] Imagine
nu imi gaseste DWORD GetAttrVnum(DWORD dwVnum) const
Cauta si tu un const oarecare sau cauta doar asta GetAttrVnum si pui functia sub toata aia.

[ Postat de pe Android ] Imagine
//retras
Afișează semnătura
Avatar utilizator
Athero
Ţepar / Untrusted User

Ţepar / Untrusted User
Mesaje: 3936
Membru din: 17 Aug 2017, 00:08
Aprecieri: 559  
Mulţumiri: 7142  
Discord: Copiază ID
Medalii

Vaynz scrie: ↑17 Mar 2020, 10:17
Athero scrie: ↑17 Mar 2020, 10:01
Vaynz scrie: ↑17 Mar 2020, 09:57 GetGroupSize nu ai asta in binary ia si tu dintr-un alt sv asta.
Fara suparare dar, e total gresit.

Iti lipseste din item_manager.h functia.
Cauta in oricare sursa de la martysama, ar trebui sa le aibe.

Intra in item_manager.h si cauta:
DWORD GetAttrVnum(DWORD dwVnum) const
{
............
}
sub asta adaugi
// Group의 Size를 return해준다.
int GetGroupSize() const
{
return m_vecProbs.size();
}

[ Postat de pe Android ] Imagine
OFF: sarutmana tata Athero, prea dimineata si am gresit eu.
Te iert de data asta

[ Postat de pe Android ] Imagine
//retras
Afișează semnătura
Avatar utilizator
xKratos
Ţepar / Untrusted User

Ţepar / Untrusted User
Mesaje: 381
Membru din: 15 Ian 2020, 18:04
Regat: Chunjo
Aprecieri: 116  
Mulţumiri: 2005  
Discord: Copiază ID
 Contact:
Medalii

Athero scrie: ↑17 Mar 2020, 10:10
Lirium scrie: ↑17 Mar 2020, 10:09
Athero scrie: ↑17 Mar 2020, 10:01

Fara suparare dar, e total gresit.

Iti lipseste din item_manager.h functia.
Cauta in oricare sursa de la martysama, ar trebui sa le aibe.

Intra in item_manager.h si cauta:
DWORD GetAttrVnum(DWORD dwVnum) const
{
............
}
sub asta adaugi
// Group의 Size를 return해준다.
int GetGroupSize() const
{
return m_vecProbs.size();
}

[ Postat de pe Android ] Imagine
nu imi gaseste DWORD GetAttrVnum(DWORD dwVnum) const
Cauta si tu un const oarecare sau cauta doar asta GetAttrVnum si pui functia sub toata aia.

[ Postat de pe Android ] Imagine
In file included from building.cpp:4:
item_manager.h:180: error: 'CSpecialItemInfo' was not declared in this scope
item_manager.h:180: error: template argument 1 is invalid
item_manager.h:180: error: template argument 2 is invalid
item_manager.h:180: error: invalid type in declaration before ';' token
item_manager.h:181: error: expected declaration before '}' token
In file included from char_battle.cpp:8:
item_manager.h:180: error: 'CSpecialItemInfo' was not declared in this scope
item_manager.h:180: error: template argument 1 is invalid
item_manager.h:180: error: template argument 2 is invalid
item_manager.h:180: error: invalid type in declaration before ';' token
item_manager.h:181: error: expected declaration before '}' token
gmake: *** [OBJDIR/building.o] Error 1
gmake: *** Waiting for unfinished jobs....
gmake: *** [OBJDIR/char_battle.o] Error 1
In file included from battle.cpp:9:
item_manager.h:180: error: 'CSpecialItemInfo' was not declared in this scope
item_manager.h:180: error: template argument 1 is invalid
item_manager.h:180: error: template argument 2 is invalid
item_manager.h:180: error: invalid type in declaration before ';' token
item_manager.h:181: error: expected declaration before '}' token
gmake: *** [OBJDIR/battle.o] Error 1

Mi-a dat alta eroare dupa ce l-am pus cum ai spus
Afișează semnătura
Avatar utilizator
xKratos
Ţepar / Untrusted User

Ţepar / Untrusted User
Mesaje: 381
Membru din: 15 Ian 2020, 18:04
Regat: Chunjo
Aprecieri: 116  
Mulţumiri: 2005  
Discord: Copiază ID
 Contact:
Medalii

T/C mersi athero
Afișează semnătura
Avatar utilizator
Kidro
Membru Club

Membru Club
Mesaje: 2487
Membru din: 29 Aug 2019, 16:49
Aprecieri: 331  
Mulţumiri: 5190  
Discord: Copiază ID
Medalii

Problema rezolvata, arhivat.

[ Postat de pe Android ] Imagine
Închis
Răspunsuri
7
Vizualizări
470
Răspunsuri
8
Vizualizări
423
Răspunsuri
3
Vizualizări
504

Înapoi la “Probleme rezolvate”

  • Informaţie
  • Cine este conectat

    Utilizatori ce ce navighează pe acest forum: Niciun utilizator înregistrat și 50 vizitatori