Compilare sursa roua

Totalitatea subiectelor care nu respectă regulamentul impus in sectiunea "Probleme şi Întrebări" vor fi stocate aici.
Închis
Avatar utilizator
FALLEN1
Nivel 4

Nivel 4
Mesaje: 585
Membru din: 14 Noi 2015, 20:12
Server: Dark-Fusion2
Regat: Chunjo
Aprecieri: 366  
Mulţumiri: 758  
  Rezolvări prob.: 2
Discord: Copiază ID
Medalii

*Problemă/Întrebare: Eroare compilare sursa game
Tipologie server(PvM / PvP): pvm
*Resursă folosită: *Link exclusiv J4M* sursa/python-sistem-roua-t84826.html
*ServerFiles utilizat: -
*Syserr:
In member function 'bool CHARACTER::UseItemEx(LPITEM, TItemPos)':
char_item.cpp:2613:8: error: case label 'NEW_MOVE_SPEED_POTION' not within a switch statement
case NEW_MOVE_SPEED_POTION:
^
char_item.cpp:2614:8: error: case label 'NEW_ATTACK_SPEED_POTION' not within a switch statement
case NEW_ATTACK_SPEED_POTION:
^
char_item.cpp:2625:11: error: break statement not within loop or switch
break;
^
char_item.cpp:2658:9: error: break statement not within loop or switch
break;
^
char_item.cpp:2659:8: error: case label 'NEW_KRITIK_POTION' not within a switch statement
case NEW_KRITIK_POTION:
^
char_item.cpp:2660:8: error: case label 'NEW_DELICI_POTION' not within a switch statement
case NEW_DELICI_POTION:
^
char_item.cpp:2661:8: error: case label 'NEW_DRAGON_1_POTION' not within a switch statement
case NEW_DRAGON_1_POTION:
^
char_item.cpp:2662:8: error: case label 'NEW_DRAGON_2_POTION' not within a switch statement
case NEW_DRAGON_2_POTION:
^
char_item.cpp:2663:8: error: case label 'NEW_DRAGON_3_POTION' not within a switch statement
case NEW_DRAGON_3_POTION:
^
char_item.cpp:2664:8: error: case label 'NEW_DRAGON_4_POTION' not within a switch statement
case NEW_DRAGON_4_POTION:
^
char_item.cpp:2687:11: error: break statement not within loop or switch
break;
^
char_item.cpp:2738:9: error: break statement not within loop or switch
break;
^
char_item.cpp:2739:8: error: case label 'NEW_SEBNEM_PEMBE' not within a switch statement
case NEW_SEBNEM_PEMBE:
^
char_item.cpp:2740:8: error: case label 'NEW_SEBNEM_KIRMIZI' not within a switch statement
case NEW_SEBNEM_KIRMIZI:
^
char_item.cpp:2741:8: error: case label 'NEW_SEBNEM_MAVI' not within a switch statement
case NEW_SEBNEM_MAVI:
^
char_item.cpp:2742:8: error: case label 'NEW_SEBNEM_BEYAZ' not within a switch statement
case NEW_SEBNEM_BEYAZ:
^
char_item.cpp:2743:8: error: case label 'NEW_SEBNEM_YESIL' not within a switch statement
case NEW_SEBNEM_YESIL:
^
char_item.cpp:2744:8: error: case label 'NEW_SEBNEM_SARI' not within a switch statement
case NEW_SEBNEM_SARI:
^
char_item.cpp:2767:11: error: break statement not within loop or switch
break;
^
char_item.cpp:2818:9: error: break statement not within loop or switch
break;
^
compiling cmd.cpp
gmake: *** [.obj/char_item.o] Error 1
gmake: *** Waiting for unfinished jobs....
root@host:/usr/src/vlad/Files/game/src #
Poză:
*Detalii suplimentare:Sunt cam nou in asta si nu mi dau seama ce e gresit acolo
Avatar utilizator
FALLEN1
Nivel 4

Nivel 4
Mesaje: 585
Membru din: 14 Noi 2015, 20:12
Server: Dark-Fusion2
Regat: Chunjo
Aprecieri: 366  
Mulţumiri: 758  
  Rezolvări prob.: 2
Discord: Copiază ID
Medalii

up
Avatar utilizator
FALLEN1
Nivel 4

Nivel 4
Mesaje: 585
Membru din: 14 Noi 2015, 20:12
Server: Dark-Fusion2
Regat: Chunjo
Aprecieri: 366  
Mulţumiri: 758  
  Rezolvări prob.: 2
Discord: Copiază ID
Medalii

up
Avatar utilizator
Ionuţ M.
Metin Master

Metin Master
Mesaje: 2680
Membru din: 28 Noi 2015, 22:02
Aprecieri: 170  
Mulţumiri: 12723  
  Rezolvări prob.: 2
Discord: Copiază ID
 Contact:
Medalii

Inactiv,arhivat.
Imagine
Afișează semnătura
Închis

Înapoi la “Arhivă Probleme şi Întrebări”

  • Informaţie
  • Cine este conectat

    Utilizatori ce ce navighează pe acest forum: Niciun utilizator înregistrat și 55 vizitatori