Cod: Selectaţi tot
In file included from BattleArena.cpp:6:
char.h: In member function 'int CHARACTER::GetBattlePassEndTime()':
char.h:2657: error: 'get_global_time' was not declared in this scope
Compile: block_country.cpp
Compile: buffer_manager.cpp
Compile: building.cpp
Compile: castle.cpp
gmake: *** [OBJDIR/BattleArena.o] Error 1
gmake: *** Waiting for unfinished jobs....
In file included from ani.cpp:11:
char.h: In member function 'int CHARACTER::GetBattlePassEndTime()':
char.h:2657: error: 'get_global_time' was not declared in this scope
gmake: *** [OBJDIR/ani.o] Error 1
In file included from aura_refine.cpp:2:
char.h: In member function 'int CHARACTER::GetBattlePassEndTime()':
char.h:2657: error: 'get_global_time' was not declared in this scope
In file included from OXEvent.cpp:9:
char.h: In member function 'int CHARACTER::GetBattlePassEndTime()':
char.h:2657: error: 'get_global_time' was not declared in this scope
gmake: *** [OBJDIR/OXEvent.o] Error 1
In file included from arena.cpp:9:
char.h: In member function 'int CHARACTER::GetBattlePassEndTime()':
char.h:2657: error: 'get_global_time' was not declared in this scope
gmake: *** [OBJDIR/arena.o] Error 1
gmake: *** [OBJDIR/aura_refine.o] Error 1
In file included from building.cpp:8:
char.h: In member function 'int CHARACTER::GetBattlePassEndTime()':
char.h:2657: error: 'get_global_time' was not declared in this scope
In file included from castle.cpp:21:
char.h: In member function 'int CHARACTER::GetBattlePassEndTime()':
char.h:2657: error: 'get_global_time' was not declared in this scope
gmake: *** [OBJDIR/castle.o] Error 1
gmake: *** [OBJDIR/building.o] Error 1


