Tipologie server:PvM
*Resursă folosită:svf-pentru-resurse/serverfiles-ephelion ... 92084.html
*ServerFiles utilizat:svf-pentru-resurse/serverfiles-ephelion ... 92084.html
*Syserr:N/A
Poză:N/A
*Detalii suplimentare:Cand rulez comanda de compilare a sursei am urmatoarele erori:
Cod: Selectaţi tot
root@localhost:/usr/src/Server/source/game/src # gmake -j20
[OK] abuse.cpp
[OK] activity.cpp
[OK] affect.cpp
[OK] ani.cpp
[OK] arena.cpp
[OK] banword.cpp
[OK] battle.cpp
[OK] BattleArena.cpp
[OK] blend_item.cpp
[OK] BlueDragon.cpp
[OK] BlueDragon_Binder.cpp
[OK] buff_on_attributes.cpp
[OK] buffer_manager.cpp
[OK] building.cpp
[OK] char.cpp
[OK] char_affect.cpp
[OK] char_battle.cpp
[OK] char_change_empire.cpp
[OK] char_dragonsoul.cpp
[OK] char_gaya.cpp
In file included from In file included from affect.cppactivity.cpp::11:
:
In file included from In file included from ./stdafx.h./stdafx.h::3838:
:
./event.h./event.h::88::1010:: fatal errorfatal error: : 'boost/intrusive_ptr.h pp''boost/intrusive_ptr.hpp' filefile notnot foundfound
#include <boost/intrusive_ptr.hpp>#include <boost/intrusive_ptr.hpp>
^~~~~~~~~~~~~~~~~~~~~~~~~ ^~~~~~~~~~~~~~~~~~~~~~~~~
1 error generated.
gmake: *** [Makefile:224: .obj/affect.o] Error 1
gmake: *** Waiting for unfinished jobs....
1 error generated.
gmake: *** [Makefile:224: .obj/activity.o] Error 1
In file included from In file included from banword.cppabuse.cpp::1In file inclu ded from 1:
ani.cppIn file included from :
:./stdafx.hIn file included from 1:./stdafx.h:
38::
In file included from 38./stdafx.h:
./event.h::38./event.h8:
::./event.h810:::810 ::10 :fatal error : fatal error: fatal error'boost/intrusiv e_ptr.hpp': 'boost/intrusive_ptr.hpp'file 'boost/intrusive_ptr.hpp'filenot f ilenotfound notfound
#include <boost/intrusive_ptr.hpp>found
#include <boost/intrusive_ptr.hpp>
^~~~~~~~~~~~~~~~~~~~~~~~~#include <boost/intrusive_ptr.hpp>
^~~~~~~~~~~~~~~~~~~~~~~~~
^~~~~~~~~~~~~~~~~~~~~~~~~
1 error generated.
gmake: *** [Makefile:224: .obj/banword.o] Error 1
1 error generated.
gmake: *** [Makefile:224: .obj/ani.o] Error 1
In file included from arena.cpp:1:
In file included from ./stdafx.h:38:
./event.h:8:10: fatal error: 'boost/intrusive_ptr.hpp' file not found
#include <boost/intrusive_ptr.hpp>
^~~~~~~~~~~~~~~~~~~~~~~~~
1 error generated.
In file included from In file included from blend_item.cppbattle.cpp::11:
:
In file included from In file included from ./stdafx.h./stdafx.h::3838:
:
./event.h./event.h::88::1010:: fatal errorfatal error: : 'boost/intrusive_ptr.hpp''boost/intrusive_ptr.hpp' filefile notnot foundfound
#include <boost/intrusive_ptr.hpp>#include <boost/intrusive_ptr.hpp>
^~~~~~~~~~~~~~~~~~~~~~~~~ ^~~~~~~~~~~~~~~~~~~~~~~~~
1 error generated.
1 error generated.
In file included from char_change_empire.cpp:1:
In file included from ./stdafx.h:38:
./event.h:8:10: fatal error: 'boost/intrusive_ptr.hpp' file not found
#include <boost/intrusive_ptr.hpp>
^~~~~~~~~~~~~~~~~~~~~~~~~
In file included from buff_on_attributes.cpp:1:
In file included from ./stdafx.h:38:
./event.h:8:10: fatal error: 'boost/intrusive_ptr.hpp' file not found
#include <boost/intrusive_ptr.hpp>
^~~~~~~~~~~~~~~~~~~~~~~~~
1 error generated.
1 error generated.
gmake: *** [Makefile:224: .obj/blend_item.o] Error 1
gmake: *** [Makefile:224: .obj/buff_on_attributes.o] Error 1
gmake: *** [Makefile:224: .obj/arena.o] Error 1
gmake: *** [Makefile:224: .obj/abuse.o] Error 1
1 error generated.
gmake: *** [Makefile:224: .obj/battle.o] Error 1
In file included from BattleArena.cpp:1:
In file included from ./stdafx.h:38:
./event.h:8:10: fatal error: 'boost/intrusive_ptr.hpp' file not found
#include <boost/intrusive_ptr.hpp>
^~~~~~~~~~~~~~~~~~~~~~~~~
1 errorIn file included from generatedBlueDragon.cpp.
:1gmake: *** [Makefile:224: .obj/BattleArena.o] Error 1
:
In file included from ./stdafx.h:38:
./event.h:8:10: fatal error: 'boost/intrusive_ptr.hpp' file not found
#include <boost/intrusive_ptr.hpp>
^~~~~~~~~~~~~~~~~~~~~~~~~
In file included from In file included from buffer_manager.cppBlueDragon_Binder.cpp::11:
:
In file included from In file included from ./stdafx.h./stdafx.h::3838:
:
./event.h./event.h::881:: error1010 generated::.
gmake: *** [Makefile:224: .obj/BlueDragon.o] Error 1
fatal errorfatal error: : 'boost/intrusive_ptr.hpp''boost/intrusive_ptr.hpp' filefile notnot foundfound
#include <boost/intrusive_ptr.hpp>#include <boost/intrusive_ptr.hpp>
^~~~~~~~~~~~~~~~~~~~~~~~~ ^~~~~~~~~~~~~~~~~~~~~~~~~
1 error generated.
1 error generated.
gmake: *** [Makefile:224: .obj/BlueDragon_Binder.o] Error 1
gmake: *** [Makefile:224: .obj/char_change_empire.o] Error 1
gmake: *** [Makefile:224: .obj/buffer_manager.o] Error 1
In file included from building.cpp:1In file included from :
char_affect.cppIn file included from :In file included from ./stdafx.h1char_battle.cpp::
In file included from :38In file included from char.cpp1:
./stdafx.h::
:1In file included from ./event.h38:
./stdafx.hIn file included from ::
In file included from :char_gaya.cpp8./stdafx.h38::./event.h::
In file included from 110:38char_dragonsoul.cpp:
:8:
./event.h:In file included from ::1./stdafx.h10./event.h8:
:fatal error:::In file included from 38: 810./stdafx.h:
:::10 38./event.h'boost/intrusive_ptr.hpp'fatal error::
: : 8filefatal error./event.h: : :10not'boost/intrusive_ptr.hpp'fatal error8: : : foundfile'boost/intrusive_ptr.hpp'10 :
not'boost/intrusive_ptr.hpp'file fatal error#include <boost/intrusive_ptr.hpp> :
foundfilenot fatal error ^~~~~~~~~~~~~~~~~~~~~~~~~
notfound: 'boost/intrusive_ptr.hpp'
#include <boost/intrusive_ptr.hpp>
found
file#include <boost/intrusive_ptr.hpp>'boost/intrusive_ptr.hpp' ^~~~~~~~~~~~~~~~~~~~~~~~~
not
#include <boost/intrusive_ptr.hpp>file
^~~~~~~~~~~~~~~~~~~~~~~~~ found
not ^~~~~~~~~~~~~~~~~~~~~~~~~
found#include <boost/intrusive_ptr.hpp>
#include <boost/intrusive_ptr.hpp> ^~~~~~~~~~~~~~~~~~~~~~~~~1
error generated ^~~~~~~~~~~~~~~~~~~~~~~~~.
gmake: *** [Makefile:224: .obj/building.o] Error 1
1 error generated.
gmake: *** [Makefile:224: .obj/char_affect.o] Error 1
11 error error1 generated error.
generated.
gmake: *** [Makefile:224: .obj/char_gaya.o] Error 1
gmake: *** [Makefile:224: .obj/char_dragonsoul.o] Error 1
generated.
1gmake: *** [Makefile:224: .obj/char_battle.o] Error 1
error generated.
gmake: *** [Makefile:224: .obj/char.o] Error 1






