In file included from char.cpp:9:
System_Battlepass.cpp: In member function 'void CHARACTER::DoMission(int, long l ong int)':
System_Battlepass.cpp:19: error: 'LocaleService_GetBasePath' was not declared in this scope
System_Battlepass.cpp: In member function 'void CHARACTER::Load_BattlePass()':
System_Battlepass.cpp:60: error: 'LocaleService_GetBasePath' was not declared in this scope
System_Battlepass.cpp: In member function 'void CHARACTER::ExternBattlePass()':
System_Battlepass.cpp:110: error: 'LocaleService_GetBasePath' was not declared i n this scope
System_Battlepass.cpp: In member function 'void CHARACTER::FinalRewardBattlePass ()':
System_Battlepass.cpp:211: error: 'LocaleService_GetBasePath' was not declared i n this scope
In file included from char.cpp:62:
System_Battlepass.cpp: At global scope:
System_Battlepass.cpp:1: error: redefinition of 'void CHARACTER::DoMission(int, long long int)'
System_Battlepass.cpp:1: error: 'void CHARACTER::DoMission(int, long long int)' previously defined here
System_Battlepass.cpp:49: error: redefinition of 'void CHARACTER::Load_BattlePas s()'
System_Battlepass.cpp:49: error: 'void CHARACTER::Load_BattlePass()' previously defined here
System_Battlepass.cpp:96: error: redefinition of 'void CHARACTER::ExternBattlePa ss()'
System_Battlepass.cpp:96: error: 'void CHARACTER::ExternBattlePass()' previously defined here
System_Battlepass.cpp:183: error: redefinition of 'void CHARACTER::SendInfosBatt lePass(int)'
System_Battlepass.cpp:183: error: 'void CHARACTER::SendInfosBattlePass(int)' pre viously defined here
System_Battlepass.cpp:194: error: redefinition of 'void CHARACTER::FinalRewardBa ttlePass()'
System_Battlepass.cpp:194: error: 'void CHARACTER::FinalRewardBattlePass()' prev iously defined here
gmake: *** [.obj/char.o] Error 1
System_Battlepass.cpp: In member function 'void CHARACTER::DoMission(int, long l ong int)':
System_Battlepass.cpp:19: error: 'LocaleService_GetBasePath' was not declared in this scope
System_Battlepass.cpp: In member function 'void CHARACTER::Load_BattlePass()':
System_Battlepass.cpp:60: error: 'LocaleService_GetBasePath' was not declared in this scope
System_Battlepass.cpp: In member function 'void CHARACTER::ExternBattlePass()':
System_Battlepass.cpp:110: error: 'LocaleService_GetBasePath' was not declared i n this scope
System_Battlepass.cpp: In member function 'void CHARACTER::FinalRewardBattlePass ()':
System_Battlepass.cpp:211: error: 'LocaleService_GetBasePath' was not declared i n this scope
In file included from char.cpp:62:
System_Battlepass.cpp: At global scope:
System_Battlepass.cpp:1: error: redefinition of 'void CHARACTER::DoMission(int, long long int)'
System_Battlepass.cpp:1: error: 'void CHARACTER::DoMission(int, long long int)' previously defined here
System_Battlepass.cpp:49: error: redefinition of 'void CHARACTER::Load_BattlePas s()'
System_Battlepass.cpp:49: error: 'void CHARACTER::Load_BattlePass()' previously defined here
System_Battlepass.cpp:96: error: redefinition of 'void CHARACTER::ExternBattlePa ss()'
System_Battlepass.cpp:96: error: 'void CHARACTER::ExternBattlePass()' previously defined here
System_Battlepass.cpp:183: error: redefinition of 'void CHARACTER::SendInfosBatt lePass(int)'
System_Battlepass.cpp:183: error: 'void CHARACTER::SendInfosBattlePass(int)' pre viously defined here
System_Battlepass.cpp:194: error: redefinition of 'void CHARACTER::FinalRewardBa ttlePass()'
System_Battlepass.cpp:194: error: 'void CHARACTER::FinalRewardBattlePass()' prev iously defined here
gmake: *** [.obj/char.o] Error 1






