sdggdsgsddsgsggsd scrie: ↑16 Dec 2020, 13:37
Eroare Client Source

(((( Visual Studio 2013
1>------ Build started: Project: CWebBrowser, Configuration: Release Win32 ------
2>------ Build started: Project: EffectLib, Configuration: Release Win32 ------
1> CWebBrowser.vcxproj -> C:\Users\Stolbys\Desktop\Sursa Launcher\Client\projects\CWebBrowser\Release\CWebBrowser.lib
3>------ Build started: Project: EterGrnLib, Configuration: Release Win32 ------
2> StdAfx.cpp
3> StdAfx.cpp
3>c:\users\stolbys\desktop\sursa launcher\client\source\etergrnlib\stdafx.h(6): fatal error C1083: Cannot open include file: 'granny.h': No such file or directory
4>------ Build started: Project: EterImageLib, Configuration: Release Win32 ------
4> DXTCImage.cpp
4>..\..\source\EterImageLib\DXTCImage.cpp(4): fatal error C1083: Cannot open include file: 'd3d.h': No such file or directory
4> TGAImage.cpp
4>c:\users\stolbys\desktop\sursa launcher\client\source\eterbase\lzo.h(5): fatal error C1083: Cannot open include file: 'lzo-2.03/lzo1x.h': No such file or directory
5>------ Build started: Project: EterPythonLib, Configuration: Release Win32 ------
5> StdAfx.cpp
5>c:\users\stolbys\desktop\sursa launcher\client\source\eterpythonlib\../EterLib/StdAfx.h(23): fatal error C1083: Cannot open include file: 'd3d8.h': No such file or directory
6>------ Build started: Project: GameLib, Configuration: Release Win32 ------
6> StdAfx.cpp
2>c:\users\stolbys\desktop\sursa launcher\client\source\effectlib\../eterLib/StdAfx.h(23): fatal error C1083: Cannot open include file: 'd3d8.h': No such file or directory
6>c:\users\stolbys\desktop\sursa launcher\client\source\gamelib\../eterLib/StdAfx.h(23): fatal error C1083: Cannot open include file: 'd3d8.h': No such file or directory
7>------ Build started: Project: MilesLib, Configuration: Release Win32 ------
8>------ Build started: Project: PRTerrainLib, Configuration: Release Win32 ------
7> Stdafx.cpp
7>c:\users\stolbys\desktop\sursa launcher\client\source\mileslib\stdafx.h(12): fatal error C1083: Cannot open include file: 'mss.h': No such file or directory
8> StdAfx.cpp
9>------ Build started: Project: ScriptLib, Configuration: Release Win32 ------
8>c:\users\stolbys\desktop\sursa launcher\client\source\prterrainlib\../EterLib/StdAfx.h(23): fatal error C1083: Cannot open include file: 'd3d8.h': No such file or directory
10>------ Build started: Project: SpeedTreeLib, Configuration: Release Win32 ------
10> StdAfx.cpp
9> StdAfx.cpp
9>c:\users\stolbys\desktop\sursa launcher\client\source\scriptlib\../eterLib/StdAfx.h(23): fatal error C1083: Cannot open include file: 'd3d8.h': No such file or directory
10>c:\users\stolbys\desktop\sursa launcher\client\source\speedtreelib\SpeedTreeForest.h(35): fatal error C1083: Cannot open include file: 'SpeedTreeRT.h': No such file or directory
11>------ Build started: Project: SphereLib, Configuration: Release Win32 ------
12>------ Build started: Project: EterBase, Configuration: Release Win32 ------
11> StdAfx.cpp
11>c:\users\stolbys\desktop\sursa launcher\client\source\spherelib\stdafx.h(7): fatal error C1083: Cannot open include file: 'd3d8.h': No such file or directory
12> lzo.cpp
13>------ Build started: Project: EterLib, Configuration: Release Win32 ------
13> StdAfx.cpp
12>..\..\source\EterBase\lzo.cpp(3): fatal error C1083: Cannot open include file: 'lzo-2.03/lzoLibLink.h': No such file or directory
12> MappedFile.cpp
13>c:\users\stolbys\desktop\sursa launcher\client\source\eterlib\stdafx.h(23): fatal error C1083: Cannot open include file: 'd3d8.h': No such file or directory
12>c:\users\stolbys\desktop\sursa launcher\client\source\eterbase\lzo.h(5): fatal error C1083: Cannot open include file: 'lzo-2.03/lzo1x.h': No such file or directory
12> Generating Code...
14>------ Build started: Project: EterLocale, Configuration: Release Win32 ------
15>------ Build started: Project: EterPack, Configuration: Release Win32 ------
14> EterLocale.vcxproj -> C:\Users\Stolbys\Desktop\Sursa Launcher\Client\projects\EterLocale\Release\EterLocale.lib
16>------ Build started: Project: UserInterface, Configuration: Release Win32 ------
15> EterPack.cpp
16> StdAfx.cpp
15>c:\users\stolbys\desktop\sursa launcher\client\source\eterpack\EterPack.h(5): fatal error C1083: Cannot open include file: 'boost/unordered_map.hpp': No such file or directory
15> EterPackCursor.cpp
15>c:\users\stolbys\desktop\sursa launcher\client\source\eterpack\EterPack.h(5): fatal error C1083: Cannot open include file: 'boost/unordered_map.hpp': No such file or directory
15> EterPackManager.cpp
15>c:\users\stolbys\desktop\sursa launcher\client\source\eterpack\EterPackManager.h(4): fatal error C1083: Cannot open include file: 'boost/unordered_map.hpp': No such file or directory
15> EterPackPolicy_CSHybridCrypt.cpp
16>c:\users\stolbys\desktop\sursa launcher\client\source\userinterface\../eterLib/StdAfx.h(23): fatal error C1083: Cannot open include file: 'd3d8.h': No such file or directory
15>c:\users\stolbys\desktop\sursa launcher\client\source\eterpack\EterPackPolicy_CSHybridCrypt.h(4): fatal error C1083: Cannot open include file: 'boost/unordered_map.hpp': No such file or directory
15> Generating Code...
========== Build: 2 succeeded, 14 failed, 0 up-to-date, 0 skipped ==========