Probema compilare sursa

Totalitatea subiectelor care nu respectă regulamentul impus in sectiunea "Probleme şi Întrebări" vor fi stocate aici.
Închis
Avatar utilizator
Kotlazeu
Nou Venit

Nou Venit
Mesaje: 9
Membru din: 09 Mar 2021, 13:23
Regat: Jinno
Aprecieri: 110  
Mulţumiri: 0
Medalii

Cum as putea rezolva aceasta eroare la compilarea sursei?
Folosesc FreeBSD 12.0

Compile: FSM.cpp
Compile: BattleArena.cpp
gmake: g++: Command not found
gmake: *** [Makefile:126: OBJDIR/FSM.o] Error 127
gmake: *** Waiting for unfinished jobs....
Compile: MarkConvert.cpp
gmake: g++: Command not found
gmake: *** [Makefile:126: OBJDIR/BattleArena.o] Error 127
gmake: g++: Command not found
gmake: *** [Makefile:126: OBJDIR/MarkConvert.o] Error 127
Avatar utilizator
Kidro
Membru Club

Membru Club
Mesaje: 2487
Membru din: 29 Aug 2019, 16:49
Aprecieri: 331  
Mulţumiri: 5190  
Discord: Copiază ID
Medalii

pkg install gcc

[ Postat de pe Android ] Imagine
Avatar utilizator
Kotlazeu
Nou Venit

Nou Venit
Mesaje: 9
Membru din: 09 Mar 2021, 13:23
Regat: Jinno
Aprecieri: 110  
Mulţumiri: 0
Medalii

Tot apar erori dupa ce porneste procesul :/
Avatar utilizator
Kotlazeu
Nou Venit

Nou Venit
Mesaje: 9
Membru din: 09 Mar 2021, 13:23
Regat: Jinno
Aprecieri: 110  
Mulţumiri: 0
Medalii

Up
Avatar utilizator
Kazuhiri
Nivel 9

Nivel 9
Mesaje: 2088
Membru din: 26 Mar 2017, 19:14
Server: Demetris
Regat: Shinsoo
Aprecieri: 396  
Mulţumiri: 3227  
  Rezolvări prob.: 2
Discord: Copiază ID
Medalii

Kotlazeu scrie: ↑28 Mar 2021, 00:29 Tot apar erori dupa ce porneste procesul :/
pai ce erori iti apar?
Demetris2 Imagine
Afișează semnătura
Avatar utilizator
Kotlazeu
Nou Venit

Nou Venit
Mesaje: 9
Membru din: 09 Mar 2021, 13:23
Regat: Jinno
Aprecieri: 110  
Mulţumiri: 0
Medalii

Kazuhiri scrie: ↑29 Mar 2021, 22:54
Kotlazeu scrie: ↑28 Mar 2021, 00:29 Tot apar erori dupa ce porneste procesul :/
pai ce erori iti apar?
/usr/local/lib/gcc9/include/c++/bits/locale_conv.h:182:6: error: reference to 'b asic_string' is ambiguous
182 | basic_string<char, _Traits, _Alloc>& __outstr,
| ^~~~~~~~~~~~
In file included from /usr/local/lib/gcc9/include/c++/string:39,
from /usr/local/lib/gcc9/include/c++/stdexcept:39,
from /usr/local/lib/gcc9/include/c++/array:39,
from /usr/local/lib/gcc9/include/c++/tuple:39,
from /usr/local/lib/gcc9/include/c++/bits/stl_map.h:63,
from /usr/local/lib/gcc9/include/c++/map:61,
from stdafx.h:18,
from char.cpp:1:
/usr/local/lib/gcc9/include/c++/bits/stringfwd.h:74:11: note: candidates are: 't emplate<class _CharT, class _Traits, class _Alloc> class std::__cxx11::basic_str ing'
74 | class basic_string;
| ^~~~~~~~~~~~
In file included from ../../../Extern/include/boost/functional/hash/extensions.h pp:17,
from ../../../Extern/include/boost/functional/hash/hash.hpp:494 ,
from ../../../Extern/include/boost/functional/hash.hpp:6,
from ../../../Extern/include/boost/unordered/unordered_map.hpp: 17,
from ../../../Extern/include/boost/unordered_map.hpp:16,
from char.h:4,
from char.cpp:3:
../../../Extern/include/boost/detail/container_fwd.hpp:63:65: note: 'template<class charT, class traits, class Allocator> class std::basic_strin g'
63 | template <class charT, class traits, class Allocator> class basic_st ring;
| ^~~~~~~~ ~~~~
In file included from /usr/local/lib/gcc9/include/c++/locale:43,
from ../../../Extern/include/boost/algorithm/string/classificat ion.hpp:15,
from ../../../Extern/include/boost/algorithm/string/trim.hpp:23 ,
from ../../../Extern/include/boost/algorithm/string.hpp:19,
from char.cpp:93:
/usr/local/lib/gcc9/include/c++/bits/locale_conv.h:182:6: error: 'basic_string' has not been declared
182 | basic_string<char, _Traits, _Alloc>& __outstr,
| ^~~~~~~~~~~~
/usr/local/lib/gcc9/include/c++/bits/locale_conv.h:182:18: error: expected ',' o r '...' before '<' token
182 | basic_string<char, _Traits, _Alloc>& __outstr,
| ^
/usr/local/lib/gcc9/include/c++/bits/locale_conv.h: In function 'bool std::__str _codecvt_out_all(const _CharT*, const _CharT*, int)':
/usr/local/lib/gcc9/include/c++/bits/locale_conv.h:187:49: error: '__outstr' was not declared in this scope
187 | return __str_codecvt_out(__first, __last, __outstr, __cvt, __state , __n)
| ^~~~~~~~
/usr/local/lib/gcc9/include/c++/bits/locale_conv.h:187:59: error: '__cvt' was no t declared in this scope
187 | return __str_codecvt_out(__first, __last, __outstr, __cvt, __state , __n)
| ^~~~~
gmake: *** [Makefile:125: OBJDIR/char_battle.o] Error 1
gmake: *** [Makefile:125: OBJDIR/char.o] Error 1
Avatar utilizator
Kotlazeu
Nou Venit

Nou Venit
Mesaje: 9
Membru din: 09 Mar 2021, 13:23
Regat: Jinno
Aprecieri: 110  
Mulţumiri: 0
Medalii

Up
Avatar utilizator
BRTSERGIU
Nivel 3

Nivel 3
Mesaje: 370
Membru din: 21 Apr 2019, 17:40
Server: Diverse
Regat: Chunjo
Aprecieri: 127  
Mulţumiri: 4408  
Medalii

Subiect arhivat.
Închis
Răspunsuri
4
Vizualizări
192
Răspunsuri
11
Vizualizări
860
Răspunsuri
2
Vizualizări
176

Înapoi la “Arhivă Probleme şi Întrebări”

  • Informaţie