problema compilare game eren3

Totalitatea subiectelor care nu respectă regulamentul impus in sectiunea "Probleme şi Întrebări" vor fi stocate aici.
Închis
Avatar utilizator
dudu1991
Nivel 1

Nivel 1
Mesaje: 67
Membru din: 06 Feb 2016, 20:03
Regat: Jinno
Aprecieri: 206  
Mulţumiri: 1  
Medalii

*Problemă/Întrebare: Eroare compilare a game-ului eren3
Tipologie server:pvm
*Resursă folosită: svf-pentru-resurse/serverfiles-sursa-eren3-t100615.html
*ServerFiles utilizat: eren3
*Syserr: compiling main.cpp
linking ../game_r41019
/usr/local/bin/ld: /usr/local/lib/mysql/libmysqlclient.a(my_aes_openssl.cc.o): undefined reference to symbol 'EVP_aes_128_cfb1'
/usr/local/bin/ld: /lib/libcrypto.so.8: error adding symbols: DSO missing from command line
collect2: error: ld returned 1 exit status
gmake: *** [Makefile:276: ../game_r41019] Error 1

Poză:https://i.postimg.cc/CKmD7CmH/Screenshot-1.png
*Detalii suplimentare:Am acea eroare la compilare, nu prea am gasit multe pe net legat de asta, am vazut ceva legat de un diff dar nu stiu cum sa il folosesc. Si nici mysql nu functioneaza, am mysql56, nu porneste.
aici am pus err
Închis
Răspunsuri
2
Vizualizări
246
Răspunsuri
14
Vizualizări
1324
Răspunsuri
2
Vizualizări
252
Răspunsuri
4
Vizualizări
310

Înapoi la “Arhivă Probleme şi Întrebări”

  • Informaţie
  • Cine este conectat

    Utilizatori ce ce navighează pe acest forum: Niciun utilizator înregistrat și 83 vizitatori