Tipologie server:
*Resursă folosită:
*ServerFiles utilizat:
*Syserr:
Poză:
*Detalii suplimentare: Salutare! Primesc niste erori in VS 2013 cand vreau sa compilez si nu ii dau de cap
Cod: Selectaţi tot
1>------ Build started: Project: EterLocale, Configuration: Release Win32 ------
2>------ Build started: Project: CWebBrowser, Configuration: Release Win32 ------
3>------ Build started: Project: EffectLib, Configuration: Release Win32 ------
4>------ Build started: Project: EterPack, Configuration: Release Win32 ------
2>C:\Program Files\MSBuild\Microsoft.Cpp\v4.0\V120\Microsoft.CppBuild.targets(362,5): warning MSB8003: Could not find WindowsSDKDir variable from the registry. TargetFrameworkVersion or PlatformToolset may be set to an invalid version number.
2>C:\Program Files\MSBuild\Microsoft.Cpp\v4.0\V120\Microsoft.CppBuild.targets(363,5): warning MSB8004: Intermediate Directory does not end with a trailing slash. This build instance will add the slash as it is required to allow proper evaluation of the Intermediate Directory.
2>C:\Program Files\MSBuild\Microsoft.Cpp\v4.0\V120\Microsoft.CppBuild.targets(364,5): warning MSB8004: Output Directory does not end with a trailing slash. This build instance will add the slash as it is required to allow proper evaluation of the Output Directory.
3>C:\Program Files\MSBuild\Microsoft.Cpp\v4.0\V120\Microsoft.CppBuild.targets(362,5): warning MSB8003: Could not find WindowsSDKDir variable from the registry. TargetFrameworkVersion or PlatformToolset may be set to an invalid version number.
3>C:\Program Files\MSBuild\Microsoft.Cpp\v4.0\V120\Microsoft.CppBuild.targets(363,5): warning MSB8004: Intermediate Directory does not end with a trailing slash. This build instance will add the slash as it is required to allow proper evaluation of the Intermediate Directory.
3>C:\Program Files\MSBuild\Microsoft.Cpp\v4.0\V120\Microsoft.CppBuild.targets(364,5): warning MSB8004: Output Directory does not end with a trailing slash. This build instance will add the slash as it is required to allow proper evaluation of the Output Directory.
1>C:\Program Files\MSBuild\Microsoft.Cpp\v4.0\V120\Microsoft.CppBuild.targets(362,5): warning MSB8003: Could not find WindowsSDKDir variable from the registry. TargetFrameworkVersion or PlatformToolset may be set to an invalid version number.
1>C:\Program Files\MSBuild\Microsoft.Cpp\v4.0\V120\Microsoft.CppBuild.targets(363,5): warning MSB8004: Intermediate Directory does not end with a trailing slash. This build instance will add the slash as it is required to allow proper evaluation of the Intermediate Directory.
1>C:\Program Files\MSBuild\Microsoft.Cpp\v4.0\V120\Microsoft.CppBuild.targets(364,5): warning MSB8004: Output Directory does not end with a trailing slash. This build instance will add the slash as it is required to allow proper evaluation of the Output Directory.
4>C:\Program Files\MSBuild\Microsoft.Cpp\v4.0\V120\Microsoft.CppBuild.targets(362,5): warning MSB8003: Could not find WindowsSDKDir variable from the registry. TargetFrameworkVersion or PlatformToolset may be set to an invalid version number.
4>C:\Program Files\MSBuild\Microsoft.Cpp\v4.0\V120\Microsoft.CppBuild.targets(363,5): warning MSB8004: Intermediate Directory does not end with a trailing slash. This build instance will add the slash as it is required to allow proper evaluation of the Intermediate Directory.
4>C:\Program Files\MSBuild\Microsoft.Cpp\v4.0\V120\Microsoft.CppBuild.targets(364,5): warning MSB8004: Output Directory does not end with a trailing slash. This build instance will add the slash as it is required to allow proper evaluation of the Output Directory.
4> EterPack.cpp
2> CWebBrowser.c
1> StdAfx.cpp
3> StdAfx.cpp
1>d:\metin2\colossus\eterlocale\stdafx.h(10): fatal error C1083: Cannot open include file: 'windows.h': No such file or directory
3>d:\metin2\colossus\effectlib\../eterBase/StdAfx.h(12): fatal error C1083: Cannot open include file: 'windows.h': No such file or directory
4>d:\metin2\colossus\eterpack\StdAfx.h(6): fatal error C1083: Cannot open include file: 'windows.h': No such file or directory
4> EterPackCursor.cpp
4>d:\metin2\colossus\eterpack\StdAfx.h(6): fatal error C1083: Cannot open include file: 'windows.h': No such file or directory
4> EterPackManager.cpp
5>------ Build started: Project: PRTerrainLib, Configuration: Release Win32 ------
6>------ Build started: Project: SpeedTreeLib, Configuration: Release Win32 ------
4>d:\metin2\colossus\eterpack\StdAfx.h(6): fatal error C1083: Cannot open include file: 'windows.h': No such file or directory
4> EterPackPolicy_CSHybridCrypt.cpp
5>C:\Program Files\MSBuild\Microsoft.Cpp\v4.0\V120\Microsoft.CppBuild.targets(362,5): warning MSB8003: Could not find WindowsSDKDir variable from the registry. TargetFrameworkVersion or PlatformToolset may be set to an invalid version number.
5>C:\Program Files\MSBuild\Microsoft.Cpp\v4.0\V120\Microsoft.CppBuild.targets(363,5): warning MSB8004: Intermediate Directory does not end with a trailing slash. This build instance will add the slash as it is required to allow proper evaluation of the Intermediate Directory.
5>C:\Program Files\MSBuild\Microsoft.Cpp\v4.0\V120\Microsoft.CppBuild.targets(364,5): warning MSB8004: Output Directory does not end with a trailing slash. This build instance will add the slash as it is required to allow proper evaluation of the Output Directory.
4>d:\metin2\colossus\eterpack\Stdafx.h(6): fatal error C1083: Cannot open include file: 'windows.h': No such file or directory
4> StdAfx.cpp
5> StdAfx.cpp
4>d:\metin2\colossus\eterpack\stdafx.h(6): fatal error C1083: Cannot open include file: 'windows.h': No such file or directory
4> Generating Code...
6>C:\Program Files\MSBuild\Microsoft.Cpp\v4.0\V120\Microsoft.CppBuild.targets(362,5): warning MSB8003: Could not find WindowsSDKDir variable from the registry. TargetFrameworkVersion or PlatformToolset may be set to an invalid version number.
6>C:\Program Files\MSBuild\Microsoft.Cpp\v4.0\V120\Microsoft.CppBuild.targets(363,5): warning MSB8004: Intermediate Directory does not end with a trailing slash. This build instance will add the slash as it is required to allow proper evaluation of the Intermediate Directory.
6>C:\Program Files\MSBuild\Microsoft.Cpp\v4.0\V120\Microsoft.CppBuild.targets(364,5): warning MSB8004: Output Directory does not end with a trailing slash. This build instance will add the slash as it is required to allow proper evaluation of the Output Directory.
7>------ Build started: Project: SphereLib, Configuration: Release Win32 ------
7>C:\Program Files\MSBuild\Microsoft.Cpp\v4.0\V120\Microsoft.CppBuild.targets(362,5): warning MSB8003: Could not find WindowsSDKDir variable from the registry. TargetFrameworkVersion or PlatformToolset may be set to an invalid version number.
7>C:\Program Files\MSBuild\Microsoft.Cpp\v4.0\V120\Microsoft.CppBuild.targets(363,5): warning MSB8004: Intermediate Directory does not end with a trailing slash. This build instance will add the slash as it is required to allow proper evaluation of the Intermediate Directory.
7>C:\Program Files\MSBuild\Microsoft.Cpp\v4.0\V120\Microsoft.CppBuild.targets(364,5): warning MSB8004: Output Directory does not end with a trailing slash. This build instance will add the slash as it is required to allow proper evaluation of the Output Directory.
7> StdAfx.cpp
6> StdAfx.cpp
2>CWebBrowser.c(20): fatal error C1083: Cannot open include file: 'windows.h': No such file or directory
7>D:\metin2\extern\include\d3d8.h(33): fatal error C1083: Cannot open include file: 'objbase.h': No such file or directory
5>D:\metin2\extern\include\d3d8.h(33): fatal error C1083: Cannot open include file: 'objbase.h': No such file or directory
8>------ Build started: Project: eterBase, Configuration: Release Win32 ------
9>------ Build started: Project: eterGrnLib, Configuration: Release Win32 ------
8>C:\Program Files\MSBuild\Microsoft.Cpp\v4.0\V120\Microsoft.CppBuild.targets(362,5): warning MSB8003: Could not find WindowsSDKDir variable from the registry. TargetFrameworkVersion or PlatformToolset may be set to an invalid version number.
8>C:\Program Files\MSBuild\Microsoft.Cpp\v4.0\V120\Microsoft.CppBuild.targets(363,5): warning MSB8004: Intermediate Directory does not end with a trailing slash. This build instance will add the slash as it is required to allow proper evaluation of the Intermediate Directory.
8>C:\Program Files\MSBuild\Microsoft.Cpp\v4.0\V120\Microsoft.CppBuild.targets(364,5): warning MSB8004: Output Directory does not end with a trailing slash. This build instance will add the slash as it is required to allow proper evaluation of the Output Directory.
6>D:\metin2\extern\include\d3d8.h(33): fatal error C1083: Cannot open include file: 'objbase.h': No such file or directory
10>------ Build started: Project: eterImageLib, Configuration: Release Win32 ------
11>------ Build started: Project: eterPythonLib, Configuration: Release Win32 ------
9>C:\Program Files\MSBuild\Microsoft.Cpp\v4.0\V120\Microsoft.CppBuild.targets(362,5): warning MSB8003: Could not find WindowsSDKDir variable from the registry. TargetFrameworkVersion or PlatformToolset may be set to an invalid version number.
9>C:\Program Files\MSBuild\Microsoft.Cpp\v4.0\V120\Microsoft.CppBuild.targets(363,5): warning MSB8004: Intermediate Directory does not end with a trailing slash. This build instance will add the slash as it is required to allow proper evaluation of the Intermediate Directory.
9>C:\Program Files\MSBuild\Microsoft.Cpp\v4.0\V120\Microsoft.CppBuild.targets(364,5): warning MSB8004: Output Directory does not end with a trailing slash. This build instance will add the slash as it is required to allow proper evaluation of the Output Directory.
10>C:\Program Files\MSBuild\Microsoft.Cpp\v4.0\V120\Microsoft.CppBuild.targets(362,5): warning MSB8003: Could not find WindowsSDKDir variable from the registry. TargetFrameworkVersion or PlatformToolset may be set to an invalid version number.
10>C:\Program Files\MSBuild\Microsoft.Cpp\v4.0\V120\Microsoft.CppBuild.targets(363,5): warning MSB8004: Intermediate Directory does not end with a trailing slash. This build instance will add the slash as it is required to allow proper evaluation of the Intermediate Directory.
10>C:\Program Files\MSBuild\Microsoft.Cpp\v4.0\V120\Microsoft.CppBuild.targets(364,5): warning MSB8004: Output Directory does not end with a trailing slash. This build instance will add the slash as it is required to allow proper evaluation of the Output Directory.
8> Base.cpp
11>C:\Program Files\MSBuild\Microsoft.Cpp\v4.0\V120\Microsoft.CppBuild.targets(362,5): warning MSB8003: Could not find WindowsSDKDir variable from the registry. TargetFrameworkVersion or PlatformToolset may be set to an invalid version number.
11>C:\Program Files\MSBuild\Microsoft.Cpp\v4.0\V120\Microsoft.CppBuild.targets(363,5): warning MSB8004: Intermediate Directory does not end with a trailing slash. This build instance will add the slash as it is required to allow proper evaluation of the Intermediate Directory.
11>C:\Program Files\MSBuild\Microsoft.Cpp\v4.0\V120\Microsoft.CppBuild.targets(364,5): warning MSB8004: Output Directory does not end with a trailing slash. This build instance will add the slash as it is required to allow proper evaluation of the Output Directory.
9> StdAfx.cpp
10> StdAfx.cpp
11> StdAfx.cpp
10>d:\metin2\colossus\eterimagelib\stdafx.h(19): fatal error C1083: Cannot open include file: 'windows.h': No such file or directory
8>d:\metin2\colossus\eterbase\poly\../StdAfx.h(12): fatal error C1083: Cannot open include file: 'windows.h': No such file or directory
8> Poly.cpp
11>D:\metin2\extern\include\d3d8.h(33): fatal error C1083: Cannot open include file: 'objbase.h': No such file or directory
12>------ Build started: Project: eterlib, Configuration: Release Win32 ------
8>d:\metin2\colossus\eterbase\poly\../StdAfx.h(12): fatal error C1083: Cannot open include file: 'windows.h': No such file or directory
8> Symbol.cpp
13>------ Build started: Project: gamelib, Configuration: Release Win32 ------
12>C:\Program Files\MSBuild\Microsoft.Cpp\v4.0\V120\Microsoft.CppBuild.targets(362,5): warning MSB8003: Could not find WindowsSDKDir variable from the registry. TargetFrameworkVersion or PlatformToolset may be set to an invalid version number.
12>C:\Program Files\MSBuild\Microsoft.Cpp\v4.0\V120\Microsoft.CppBuild.targets(363,5): warning MSB8004: Intermediate Directory does not end with a trailing slash. This build instance will add the slash as it is required to allow proper evaluation of the Intermediate Directory.
12>C:\Program Files\MSBuild\Microsoft.Cpp\v4.0\V120\Microsoft.CppBuild.targets(364,5): warning MSB8004: Output Directory does not end with a trailing slash. This build instance will add the slash as it is required to allow proper evaluation of the Output Directory.
8>d:\metin2\colossus\eterbase\poly\../StdAfx.h(12): fatal error C1083: Cannot open include file: 'windows.h': No such file or directory
8> SymTable.cpp
8>d:\metin2\colossus\eterbase\poly\../StdAfx.h(12): fatal error C1083: Cannot open include file: 'windows.h': No such file or directory
8> cipher.cpp
13>C:\Program Files\MSBuild\Microsoft.Cpp\v4.0\V120\Microsoft.CppBuild.targets(362,5): warning MSB8003: Could not find WindowsSDKDir variable from the registry. TargetFrameworkVersion or PlatformToolset may be set to an invalid version number.
13>C:\Program Files\MSBuild\Microsoft.Cpp\v4.0\V120\Microsoft.CppBuild.targets(363,5): warning MSB8004: Intermediate Directory does not end with a trailing slash. This build instance will add the slash as it is required to allow proper evaluation of the Intermediate Directory.
13>C:\Program Files\MSBuild\Microsoft.Cpp\v4.0\V120\Microsoft.CppBuild.targets(364,5): warning MSB8004: Output Directory does not end with a trailing slash. This build instance will add the slash as it is required to allow proper evaluation of the Output Directory.
13> StdAfx.cpp
9>d:\metin2\colossus\etergrnlib\../eterBase/Utils.h(4): fatal error C1083: Cannot open include file: 'windows.h': No such file or directory
13>d:\metin2\colossus\gamelib\../eterBase/Utils.h(4): fatal error C1083: Cannot open include file: 'windows.h': No such file or directory
14>------ Build started: Project: mileslib, Configuration: Release Win32 ------
15>------ Build started: Project: scriptLib, Configuration: Release Win32 ------
14>C:\Program Files\MSBuild\Microsoft.Cpp\v4.0\V120\Microsoft.CppBuild.targets(362,5): warning MSB8003: Could not find WindowsSDKDir variable from the registry. TargetFrameworkVersion or PlatformToolset may be set to an invalid version number.
14>C:\Program Files\MSBuild\Microsoft.Cpp\v4.0\V120\Microsoft.CppBuild.targets(363,5): warning MSB8004: Intermediate Directory does not end with a trailing slash. This build instance will add the slash as it is required to allow proper evaluation of the Intermediate Directory.
14>C:\Program Files\MSBuild\Microsoft.Cpp\v4.0\V120\Microsoft.CppBuild.targets(364,5): warning MSB8004: Output Directory does not end with a trailing slash. This build instance will add the slash as it is required to allow proper evaluation of the Output Directory.
14> Stdafx.cpp
15>C:\Program Files\MSBuild\Microsoft.Cpp\v4.0\V120\Microsoft.CppBuild.targets(362,5): warning MSB8003: Could not find WindowsSDKDir variable from the registry. TargetFrameworkVersion or PlatformToolset may be set to an invalid version number.
15>C:\Program Files\MSBuild\Microsoft.Cpp\v4.0\V120\Microsoft.CppBuild.targets(363,5): warning MSB8004: Intermediate Directory does not end with a trailing slash. This build instance will add the slash as it is required to allow proper evaluation of the Intermediate Directory.
15>C:\Program Files\MSBuild\Microsoft.Cpp\v4.0\V120\Microsoft.CppBuild.targets(364,5): warning MSB8004: Output Directory does not end with a trailing slash. This build instance will add the slash as it is required to allow proper evaluation of the Output Directory.
15> StdAfx.cpp
14>D:\metin2\extern\include\mss.h(261): fatal error C1083: Cannot open include file: 'windows.h': No such file or directory
15>D:\metin2\extern\include\d3d8.h(33): fatal error C1083: Cannot open include file: 'objbase.h': No such file or directory
12> StdAfx.cpp
12>D:\metin2\extern\include\d3d8.h(33): fatal error C1083: Cannot open include file: 'objbase.h': No such file or directory
8>d:\metin2\colossus\eterbase\stdafx.h(12): fatal error C1083: Cannot open include file: 'windows.h': No such file or directory
8> CPostIt.cpp
8>d:\metin2\colossus\eterbase\StdAfx.h(12): fatal error C1083: Cannot open include file: 'windows.h': No such file or directory
8> CRC32.cpp
8>d:\metin2\colossus\eterbase\StdAfx.h(12): fatal error C1083: Cannot open include file: 'windows.h': No such file or directory
8> Debug.cpp
8>d:\metin2\colossus\eterbase\StdAfx.h(12): fatal error C1083: Cannot open include file: 'windows.h': No such file or directory
8> error.cpp
8>d:\metin2\colossus\eterbase\StdAfx.h(12): fatal error C1083: Cannot open include file: 'windows.h': No such file or directory
8> FileBase.cpp
8>d:\metin2\colossus\eterbase\StdAfx.h(12): fatal error C1083: Cannot open include file: 'windows.h': No such file or directory
8> FileDir.cpp
8>d:\metin2\colossus\eterbase\StdAfx.h(12): fatal error C1083: Cannot open include file: 'windows.h': No such file or directory
8> FileLoader.cpp
8>d:\metin2\colossus\eterbase\StdAfx.h(12): fatal error C1083: Cannot open include file: 'windows.h': No such file or directory
8> lzo.cpp
8>d:\metin2\colossus\eterbase\StdAfx.h(12): fatal error C1083: Cannot open include file: 'windows.h': No such file or directory
8> MappedFile.cpp
8>d:\metin2\colossus\eterbase\StdAfx.h(12): fatal error C1083: Cannot open include file: 'windows.h': No such file or directory
8> Random.cpp
8>d:\metin2\colossus\eterbase\StdAfx.h(12): fatal error C1083: Cannot open include file: 'windows.h': No such file or directory
8> StdAfx.cpp
8>d:\metin2\colossus\eterbase\stdafx.h(12): fatal error C1083: Cannot open include file: 'windows.h': No such file or directory
8> Stl.cpp
8>d:\metin2\colossus\eterbase\StdAfx.h(12): fatal error C1083: Cannot open include file: 'windows.h': No such file or directory
8> tea.cpp
8>d:\metin2\colossus\eterbase\StdAfx.h(12): fatal error C1083: Cannot open include file: 'windows.h': No such file or directory
8> TempFile.cpp
8>d:\metin2\colossus\eterbase\StdAfx.h(12): fatal error C1083: Cannot open include file: 'windows.h': No such file or directory
8> Timer.cpp
8>d:\metin2\colossus\eterbase\StdAfx.h(12): fatal error C1083: Cannot open include file: 'windows.h': No such file or directory
8> Generating Code...
8> Compiling...
8> Utils.cpp
8>d:\metin2\colossus\eterbase\StdAfx.h(12): fatal error C1083: Cannot open include file: 'windows.h': No such file or directory
8> Generating Code...
16>------ Build started: Project: UserInterface, Configuration: Release Win32 ------
16>C:\Program Files\MSBuild\Microsoft.Cpp\v4.0\V120\Microsoft.CppBuild.targets(362,5): warning MSB8003: Could not find WindowsSDKDir variable from the registry. TargetFrameworkVersion or PlatformToolset may be set to an invalid version number.
16>C:\Program Files\MSBuild\Microsoft.Cpp\v4.0\V120\Microsoft.CppBuild.targets(363,5): warning MSB8004: Intermediate Directory does not end with a trailing slash. This build instance will add the slash as it is required to allow proper evaluation of the Intermediate Directory.
16>C:\Program Files\MSBuild\Microsoft.Cpp\v4.0\V120\Microsoft.CppBuild.targets(364,5): warning MSB8004: Output Directory does not end with a trailing slash. This build instance will add the slash as it is required to allow proper evaluation of the Output Directory.
16> StdAfx.cpp
16>D:\metin2\extern\include\d3d8.h(33): fatal error C1083: Cannot open include file: 'objbase.h': No such file or directory
========== Build: 0 succeeded, 16 failed, 0 up-to-date, 0 skipped ==========





