Primesc aceasta eroare cand scriu gmake clean, gmake -j20
care ar fi problema?
as fi foarte recunascator pentru o rezolvare,multumesc.
Error: linking ../game_r44213_64....
ld: error: unable to find library -lstdc++
clang-16: error: linker command failed with exit code 1 (use -v to see invocation)
gmake: *** [Makefile:124: ../game_r44213_64] Error 1
Putty: https://ufile.io/u98l5v5l
Makefile: https://ufile.io/uq7uenfb
Compliare sursa game -lstdc++
free bsd 13.1 - complierea sursei serverfile "v1" direct pe hostul clever-hostKIDDA scrie: ↑23 Feb 2023, 03:35 Mutat in probleme/?sid=a337d7dc852297000ab6cd9d4c69f742
Ce frebsd folosesti?
ai instalat clang etc?
A incercat un prieten sa instaleze toate posibilitățile si tot eroarea asta primesc.
- Wizzard
-

- Mesaje: 901
- Membru din: 05 Iul 2021, 13:37
- Server: 911.Projects
- Regat: Chunjo
- Aprecieri: 525
- Mulţumiri: 3420
- Discord: Copiază ID
- Contact:
Autonul nu a mai aratat interes fata de acest subiect . TOPIC ARHIVAT !
-
- Informaţie
-
Cine este conectat
Utilizatori ce ce navighează pe acest forum: sanducatalin1, Semrush [Bot] și 39 vizitatori


