Problema compilare sursa Demera

Totalitatea subiectelor care nu respectă regulamentul impus in sectiunea "Probleme şi Întrebări" vor fi stocate aici.
Închis
Avatar utilizator
Mexys
Nou Venit

Nou Venit
Mesaje: 15
Membru din: 30 Oct 2022, 01:03
Regat: Shinsoo
Aprecieri: 0
Mulţumiri: 0
Medalii

*Problemă/Întrebare:Salut, cand compilez sursa binary de la demera imi da 1 falied.
Tipologie server:
*Resursă folosită:
*ServerFiles utilizat:
*Syserr:
Poză:
*Detalii suplimentare:
Syserr:
Build started...
1>------ Build started: Project: EterLocale, Configuration: Release Win32 ------
2>------ Build started: Project: CWebBrowser, Configuration: Release Win32 ------
3>------ Build started: Project: EffectLib, Configuration: Release Win32 ------
4>------ Build started: Project: EterBase, Configuration: Release Win32 ------
1>StdAfx.cpp
2>CWebBrowser.c
3>StdAfx.cpp
1>Arabic.cpp
1>Japanese.cpp
1>StringCodec.cpp
1>StringCodec_Vietnamese.cpp
1>Generating Code...
1>EterLocale.vcxproj -> C:\Users\Admin\Desktop\Metin2\Source Binary Metin2\Binary\vs_files\EterLocale\Release\EterLocale.lib
2>CWebBrowser.vcxproj -> C:\Users\Admin\Desktop\Metin2\Source Binary Metin2\Binary\vs_files\CWebBrowser\Release\CWebBrowser.lib
4>StdAfx.cpp
4>cipher.cpp
3>EffectData.cpp
5>------ Build started: Project: EterGrnLib, Configuration: Release Win32 ------
6>------ Build started: Project: EterImageLib, Configuration: Release Win32 ------
4>CPostIt.cpp
4>CRC32.cpp
4>Debug.cpp
4>error.cpp
3>EffectElementBase.cpp
3>EffectElementBaseInstance.cpp
3>EffectInstance.cpp
4>FileBase.cpp
4>FileDir.cpp
4>FileLoader.cpp
4>lzo.cpp
4>MappedFile.cpp
4>Base.cpp
4>Poly.cpp
3>EffectManager.cpp
4>Symbol.cpp
4>SymTable.cpp
4>Random.cpp
4>Stl.cpp
4>tea.cpp
4>TempFile.cpp
4>Timer.cpp
6>StdAfx.cpp
4>Utils.cpp
3>EffectMesh.cpp
4>Generating Code...
5>StdAfx.cpp
6>DXTCImage.cpp
3>EffectMeshInstance.cpp
6>Image.cpp
6>TGAImage.cpp
3>EffectUpdateDecorator.cpp
3>EmitterProperty.cpp
5>LODController.cpp
3>FrameController.cpp
3>ParticleInstance.cpp
5>Material.cpp
6>EterImageLib.vcxproj -> C:\Users\Admin\Desktop\Metin2\Source Binary Metin2\Binary\vs_files\EterImageLib\Release\EterImageLib.lib
3>ParticleProperty.cpp
5>Mesh.cpp
3>ParticleSystemData.cpp
5>Model.cpp
5>ModelInstance.cpp
5>ModelInstanceCollisionDetection.cpp
3>ParticleSystemInstance.cpp
5>ModelInstanceModel.cpp
4>EterBase.vcxproj -> C:\Users\Admin\Desktop\Metin2\Source Binary Metin2\Binary\vs_files\EterBase\Release\EterBase.lib
7>------ Build started: Project: EterLib, Configuration: Release Win32 ------
5>ModelInstanceMotion.cpp
5>C:\Users\Admin\Desktop\Metin2\Source Binary Metin2\Binary\source\EterGrnLib\ModelInstanceMotion.cpp(101,36): warning C4244: 'argument': conversion from 'float' to 'granny_int32x', possible loss of data
5>ModelInstanceRender.cpp
5>ModelInstanceUpdate.cpp
3>SimpleLightData.cpp
5>Motion.cpp
3>SimpleLightInstance.cpp
5>Thing.cpp
3>Type.cpp
3>Generating Code...
5>ThingInstance.cpp
8>------ Build started: Project: EterPack, Configuration: Release Win32 ------
7>StdAfx.cpp
5>Util.cpp
5>Generating Code...
7>AttributeData.cpp
7>AttributeInstance.cpp
5>EterGrnLib.vcxproj -> C:\Users\Admin\Desktop\Metin2\Source Binary Metin2\Binary\vs_files\EterGrnLib\Release\EterGrnLib.lib
8>EterPack.cpp
7>BlockTexture.cpp
7>Camera.cpp
8>C:\Users\Admin\Desktop\Metin2\Source Binary Metin2\Binary\source\EterPack\EterPack.cpp(339,19): warning C4838: conversion from 'int' to 'DWORD' requires a narrowing conversion
8>C:\Users\Admin\Desktop\Metin2\Source Binary Metin2\Binary\source\EterPack\EterPack.cpp(340,19): warning C4838: conversion from 'int' to 'DWORD' requires a narrowing conversion
8>C:\Users\Admin\Desktop\Metin2\Source Binary Metin2\Binary\source\EterPack\EterPack.cpp(341,19): warning C4838: conversion from 'int' to 'DWORD' requires a narrowing conversion
8>C:\Users\Admin\Desktop\Metin2\Source Binary Metin2\Binary\source\EterPack\EterPack.cpp(342,19): warning C4838: conversion from 'int' to 'DWORD' requires a narrowing conversion
8>C:\Users\Admin\Desktop\Metin2\Source Binary Metin2\Binary\source\EterPack\EterPack.cpp(347,19): warning C4838: conversion from 'int' to 'DWORD' requires a narrowing conversion
8>C:\Users\Admin\Desktop\Metin2\Source Binary Metin2\Binary\source\EterPack\EterPack.cpp(348,19): warning C4838: conversion from 'int' to 'DWORD' requires a narrowing conversion
8>C:\Users\Admin\Desktop\Metin2\Source Binary Metin2\Binary\source\EterPack\EterPack.cpp(349,19): warning C4838: conversion from 'int' to 'DWORD' requires a narrowing conversion
8>C:\Users\Admin\Desktop\Metin2\Source Binary Metin2\Binary\source\EterPack\EterPack.cpp(350,19): warning C4838: conversion from 'int' to 'DWORD' requires a narrowing conversion
7>CollisionData.cpp
7>ColorTransitionHelper.cpp
7>CRenderTarget.cpp
8>EterPackCursor.cpp
3>EffectLib.vcxproj -> C:\Users\Admin\Desktop\Metin2\Source Binary Metin2\Binary\vs_files\EffectLib\Release\EffectLib.lib
5>Done building project "EterGrnLib.vcxproj".
9>------ Build started: Project: EterPythonLib, Configuration: Release Win32 ------
7>CRenderTargetManager.cpp
10>------ Build started: Project: GameLib, Configuration: Release Win32 ------
8>EterPackManager.cpp
7>CullingManager.cpp
7>Decal.cpp
7>DibBar.cpp
7>EnvironmentMap.cpp
7>FileLoaderThread.cpp
9>StdAfx.cpp
7>GrpBase.cpp
7>GrpCollisionObject.cpp
8>EterPackPolicy_CSHybridCrypt.cpp
7>GrpColor.cpp
7>GrpColorInstance.cpp
7>GrpD3DXBuffer.cpp
7>GrpDetector.cpp
9>PythonGraphic.cpp
7>GrpDevice.cpp
9>C:\Users\Admin\Desktop\Metin2\Source Binary Metin2\Binary\source\EterPythonLib\PythonGraphic.cpp(352,5): warning C4838: conversion from 'int' to 'unsigned char' requires a narrowing conversion
9>PythonGraphicImageModule.cpp
9>PythonGraphicModule.cpp
10>StdAfx.cpp
7>Generating Code...
9>PythonGraphicTextModule.cpp
9>PythonGraphicThingModule.cpp
9>PythonGridSlotWindow.cpp
9>PythonSlotWindow.cpp
9>PythonWindow.cpp
9>C:\Users\Admin\Desktop\Metin2\Source Binary Metin2\Binary\source\EterPythonLib\PythonWindow.cpp(2000,47): warning C4267: '=': conversion from 'size_t' to 'BYTE', possible loss of data
10>ActorInstance.cpp
8>StdAfx.cpp
9>PythonWindowManager.cpp
9>PythonWindowManagerModule.cpp
9>Generating Code...
7>Compiling...
7>GrpDIB.cpp
7>GrpExpandedImageInstance.cpp
7>GrpFontTexture.cpp
8>Generating Code...
10>ActorInstanceAttach.cpp
7>GrpImage.cpp
7>GrpImageInstance.cpp
7>GrpImageTexture.cpp
7>GrpIndexBuffer.cpp
10>ActorInstanceBattle.cpp
7>GrpLightManager.cpp
7>GrpMarkInstance.cpp
7>GrpMath.cpp
7>GrpObjectInstance.cpp
7>GrpPixelShader.cpp
9>EterPythonLib.vcxproj -> C:\Users\Admin\Desktop\Metin2\Source Binary Metin2\Binary\vs_files\EterPythonLib\Release\EterPythonLib.lib
7>GrpRatioInstance.cpp
7>GrpRenderTargetTexture.cpp
10>ActorInstanceBlend.cpp
8>md5.c
7>GrpScreen.cpp
7>GrpShadowTexture.cpp
7>GrpSubImage.cpp
8>EterPack.vcxproj -> C:\Users\Admin\Desktop\Metin2\Source Binary Metin2\Binary\vs_files\EterPack\Release\EterPack.lib
8>Done building project "EterPack.vcxproj".
11>------ Build started: Project: MilesLib, Configuration: Release Win32 ------
9>Done building project "EterPythonLib.vcxproj".
12>------ Build started: Project: PRTerrainLib, Configuration: Release Win32 ------
10>ActorInstanceCollisionDetection.cpp
12>StdAfx.cpp
10>ActorInstanceData.cpp
11>Stdafx.cpp
7>GrpText.cpp
7>GrpTextInstance.cpp
7>GrpTexture.cpp
7>Generating Code...
10>ActorInstanceEvent.cpp
12>Terrain.cpp
12>TextureSet.cpp
12>Generating Code...
10>ActorInstanceFly.cpp
12>TerrainLib.vcxproj -> C:\Users\Admin\Desktop\Metin2\Source Binary Metin2\Binary\vs_files\TerrainLib\Release\PRTerrainLib.lib
11>SoundBase.cpp
10>ActorInstanceMotion.cpp
7>Compiling...
7>GrpVertexBuffer.cpp
7>GrpVertexBufferDynamic.cpp
7>GrpVertexBufferStatic.cpp
7>GrpVertexShader.cpp
7>IME.cpp
7>Input.cpp
7>JpegFile.cpp
7>LensFlare.cpp
7>lineintersect_utils.cpp
7>MSApplication.cpp
11>SoundData.cpp
11>SoundInstance2D.cpp
11>SoundInstance3D.cpp
11>SoundInstanceStream.cpp
11>SoundManager.cpp
11>SoundManager2D.cpp
11>SoundManager3D.cpp
11>SoundManagerStream.cpp
11>Type.cpp
11>Generating Code...
7>MSWindow.cpp
11>MilesLib.vcxproj -> C:\Users\Admin\Desktop\Metin2\Source Binary Metin2\Binary\vs_files\MilesLib\Release\MilesLib.lib
13>------ Build started: Project: ScriptLib, Configuration: Release Win32 ------
10>ActorInstanceMotionEvent.cpp
14>------ Build started: Project: SpeedTreeLib, Configuration: Release Win32 ------
7>Mutex.cpp
7>NetAddress.cpp
7>NetDatagram.cpp
7>NetDatagramReceiver.cpp
7>NetDatagramSender.cpp
7>NetDevice.cpp
7>NetPacketHeaderMap.cpp
7>NetStream.cpp
7>parser.cpp
7>Generating Code...
13>StdAfx.cpp
7>Compiling...
7>PathStack.cpp
7>ReferenceObject.cpp
7>Resource.cpp
7>ResourceManager.cpp
7>ScreenFilter.cpp
7>SkyBox.cpp
13>PythonDebugModule.cpp
13>PythonLauncher.cpp
7>StateManager.cpp
13>PythonMarshal.cpp
7>TargaResource.cpp
13>PythonUtils.cpp
13>Resource.cpp
7>TextBar.cpp
7>TextFileLoader.cpp
10>ActorInstancePosition.cpp
14>StdAfx.cpp
10>ActorInstanceRender.cpp
10>ActorInstanceRotation.cpp
10>ActorInstanceSync.cpp
7>TextTag.cpp
7>Thread.cpp
13>Generating Code...
7>Util.cpp
14>BoundaryShapeManager.cpp
10>ActorInstanceWeaponTrace.cpp
14>SpeedGrassRT.cpp
14>SpeedGrassWrapper.cpp
14>SpeedTreeForest.cpp
7>Generating Code...
14>SpeedTreeForestDirectX8.cpp
14>C:\Users\Admin\Desktop\Metin2\Source Binary Metin2\Binary\source\SpeedTreeLib\VertexShaders.h(171,23): warning C4477: 'sprintf' : format string '%s' requires an argument of type 'char *', but variadic argument 1 has type 'LPVOID'
14>SpeedTreeWrapper.cpp
10>Area.cpp
14>C:\Users\Admin\Desktop\Metin2\Source Binary Metin2\Binary\source\SpeedTreeLib\VertexShaders.h(171,23): warning C4477: 'sprintf' : format string '%s' requires an argument of type 'char *', but variadic argument 1 has type 'LPVOID'
14>Generating Code...
13>ScriptLib.vcxproj -> C:\Users\Admin\Desktop\Metin2\Source Binary Metin2\Binary\vs_files\ScriptLib\Release\ScriptLib.lib
15>------ Build started: Project: SphereLib, Configuration: Release Win32 ------
10>AreaLoaderThread.cpp
10>AreaTerrain.cpp
14>SpeedTreeLib.vcxproj -> C:\Users\Admin\Desktop\Metin2\Source Binary Metin2\Binary\vs_files\SpeedTreeLib\Release\SpeedTreeLib.lib
7>EterLib.vcxproj -> C:\Users\Admin\Desktop\Metin2\Source Binary Metin2\Binary\vs_files\EterLib\Release\EterLib.lib
15>StdAfx.cpp
14>Done building project "SpeedTreeLib.vcxproj".
10>DungeonBlock.cpp
10>FlyingData.cpp
10>Generating Code...
15>frustum.cpp
15>sphere.cpp
15>spherepack.cpp
15>Generating Code...
15>SphereLib.vcxproj -> C:\Users\Admin\Desktop\Metin2\Source Binary Metin2\Binary\vs_files\SphereLib\Release\SphereLib.lib
10>Compiling...
10>FlyingInstance.cpp
10>FlyingObjectManager.cpp
10>FlyTarget.cpp
10>FlyTrace.cpp
10>GameEventManager.cpp
10>GameType.cpp
10>GameUtil.cpp
10>ItemData.cpp
10>ItemManager.cpp
10>MapBase.cpp
10>MapManager.cpp
10>MapOutdoor.cpp
10>MapOutdoorCharacterShadow.cpp
10>MapOutdoorIndexBuffer.cpp
10>MapOutdoorLoad.cpp
10>MapOutdoorQuadtree.cpp
10>MapOutdoorRender.cpp
10>MapOutdoorRenderHTP.cpp
10>MapOutdoorRenderSTP.cpp
10>MapOutdoorUpdate.cpp
10>Generating Code...
10>Compiling...
10>MapOutdoorWater.cpp
10>MapType.cpp
10>MapUtil.cpp
10>MonsterAreaInfo.cpp
10>PhysicsObject.cpp
10>Property.cpp
10>PropertyLoader.cpp
10>PropertyManager.cpp
10>RaceData.cpp
10>RaceDataFile.cpp
10>RaceManager.cpp
10>RaceMotionData.cpp
10>SnowEnvironment.cpp
10>SnowParticle.cpp
10>TerrainDecal.cpp
10>TerrainPatch.cpp
10>TerrainQuadtree.cpp
10>WeaponTrace.cpp
10>Generating Code...
10>GameLib.vcxproj -> C:\Users\Admin\Desktop\Metin2\Source Binary Metin2\Binary\vs_files\GameLib\Release\GameLib.lib
16>------ Build started: Project: UserInterface, Configuration: Release Win32 ------
16>StdAfx.cpp
16>AccountConnector.cpp
16>AffectFlagContainer.cpp
16>CameraProcedure.cpp
16>CheckLatestFiles.cpp
16>CPythonRenderTargetModule.cpp
16>GameType.cpp
16>GuildMarkDownloader.cpp
16>GuildMarkUploader.cpp
16>HackShield.cpp
16>HWIDManager.cpp
16>InstanceBase.cpp
16>C:\Users\Admin\Desktop\Metin2\Source Binary Metin2\Binary\source\UserInterface\InstanceBase.cpp(817,3): error C3861: 'SetAcce': identifier not found
16>C:\Users\Admin\Desktop\Metin2\Source Binary Metin2\Binary\source\UserInterface\InstanceBase.cpp(818,23): error C2065: 'CHR_SHINING_NUM': undeclared identifier
16>C:\Users\Admin\Desktop\Metin2\Source Binary Metin2\Binary\source\UserInterface\InstanceBase.cpp(819,4): error C3861: 'SetShining': identifier not found
16>C:\Users\Admin\Desktop\Metin2\Source Binary Metin2\Binary\source\UserInterface\InstanceBase.cpp(3142,58): error C2065: 'pItemData': undeclared identifier
16>C:\Users\Admin\Desktop\Metin2\Source Binary Metin2\Binary\source\UserInterface\InstanceBase.cpp(3144,24): error C2065: 'pItemData': undeclared identifier
16>InstanceBaseBattle.cpp
16>InstanceBaseEffect.cpp
16>InstanceBaseEvent.cpp
16>InstanceBaseMotion.cpp
16>InstanceBaseMovement.cpp
16>InstanceBaseTransform.cpp
16>InsultChecker.cpp
16>Locale.cpp
16>MarkImage.cpp
16>Compiling...
16>MarkManager.cpp
16>MovieMan.cpp
16>NetworkActorManager.cpp
16>NProtectGameGuard.cpp
16>ProcessCRC.cpp
16>ProcessScanner.cpp
16>PythonApplication.cpp
16>PythonApplicationCamera.cpp
16>PythonApplicationCursor.cpp
16>PythonApplicationEvent.cpp
16>PythonApplicationLogo.cpp
16>PythonApplicationModule.cpp
16>PythonApplicationProcedure.cpp
16>PythonBackground.cpp
16>PythonBackgroundModule.cpp
16>PythonChangeLook.cpp
16>PythonCharacterManager.cpp
16>PythonCharacterManagerModule.cpp
16>PythonCharacterModule.cpp
16>PythonChat.cpp
16>C:\Users\Admin\Desktop\Metin2\Source Binary Metin2\Binary\source\UserInterface\PythonChat.cpp(803,16): warning C4838: conversion from 'float' to 'LONG' requires a narrowing conversion
16>C:\Users\Admin\Desktop\Metin2\Source Binary Metin2\Binary\source\UserInterface\PythonChat.cpp(803,20): warning C4838: conversion from 'float' to 'LONG' requires a narrowing conversion
16>C:\Users\Admin\Desktop\Metin2\Source Binary Metin2\Binary\source\UserInterface\PythonChat.cpp(803,26): warning C4838: conversion from 'float' to 'LONG' requires a narrowing conversion
16>C:\Users\Admin\Desktop\Metin2\Source Binary Metin2\Binary\source\UserInterface\PythonChat.cpp(803,39): warning C4838: conversion from 'float' to 'LONG' requires a narrowing conversion
16>Compiling...
16>PythonChatModule.cpp
16>C:\Users\Admin\Desktop\Metin2\Source Binary Metin2\Binary\source\UserInterface\PythonChatModule.cpp(448,62): warning C4477: '_snprintf' : format string '%d' requires an argument of type 'int', but variadic argument 2 has type '__int64'
16>C:\Users\Admin\Desktop\Metin2\Source Binary Metin2\Binary\source\UserInterface\PythonChatModule.cpp(448,62): message : consider using '%lld' in the format string
16>C:\Users\Admin\Desktop\Metin2\Source Binary Metin2\Binary\source\UserInterface\PythonChatModule.cpp(448,62): message : consider using '%I64d' in the format string
16>PythonCloset.cpp
16>PythonConfig.cpp
16>PythonConfigModule.cpp
16>PythonEffectModule.cpp
16>PythonEventManager.cpp
16>PythonEventManagerMoudle.cpp
16>PythonExceptionSender.cpp
16>PythonExchange.cpp
16>PythonExchangeModule.cpp
16>PythonFlyModule.cpp
16>PythonGameEventManagerModule.cpp
16>PythonGuild.cpp
16>PythonIME.cpp
16>PythonIMEModule.cpp
16>PythonItem.cpp
16>PythonItemModule.cpp
16>PythonMessenger.cpp
16>PythonMiniMap.cpp
16>PythonMiniMapModule.cpp
16>Compiling...
16>PythonNetworkDatagram.cpp
16>PythonNetworkDatagramModule.cpp
16>PythonNetworkStream.cpp
16>C:\Users\Admin\Desktop\Metin2\Source Binary Metin2\Binary\source\UserInterface\PythonNetworkStream.cpp(967,2): error C2059: syntax error: 'else'
16>C:\Users\Admin\Desktop\Metin2\Source Binary Metin2\Binary\source\UserInterface\PythonNetworkStream.cpp(969,1): error C2059: syntax error: '}'
16>C:\Users\Admin\Desktop\Metin2\Source Binary Metin2\Binary\source\UserInterface\PythonNetworkStream.cpp(969,1): error C2143: syntax error: missing ';' before '}'
16>C:\Users\Admin\Desktop\Metin2\Source Binary Metin2\Binary\source\UserInterface\PythonNetworkStream.cpp(972,1): error C2143: syntax error: missing ';' before '{'
16>C:\Users\Admin\Desktop\Metin2\Source Binary Metin2\Binary\source\UserInterface\PythonNetworkStream.cpp(972,1): error C2447: '{': missing function header (old-style formal list?)
16>PythonNetworkStreamCommand.cpp
16>PythonNetworkStreamEvent.cpp
16>PythonNetworkStreamModule.cpp
16>PythonNetworkStreamPhaseGame.cpp
16>C:\Users\Admin\Desktop\Metin2\Source Binary Metin2\Binary\source\UserInterface\PythonNetworkStreamPhaseGame.cpp(2117,67): warning C4267: 'argument': conversion from 'size_t' to 'BYTE', possible loss of data
16>C:\Users\Admin\Desktop\Metin2\Source Binary Metin2\Binary\source\UserInterface\PythonNetworkStreamPhaseGame.cpp(2118,58): warning C4267: 'argument': conversion from 'size_t' to 'BYTE', possible loss of data
16>C:\Users\Admin\Desktop\Metin2\Source Binary Metin2\Binary\source\UserInterface\PythonNetworkStreamPhaseGame.cpp(2125,58): warning C4267: 'argument': conversion from 'size_t' to 'BYTE', possible loss of data
16>C:\Users\Admin\Desktop\Metin2\Source Binary Metin2\Binary\source\UserInterface\PythonNetworkStreamPhaseGame.cpp(4631,44): warning C4267: '=': conversion from 'size_t' to 'BYTE', possible loss of data
16>PythonNetworkStreamPhaseGameActor.cpp
16>PythonNetworkStreamPhaseGameItem.cpp
16>PythonNetworkStreamPhaseHandShake.cpp
16>PythonNetworkStreamPhaseLoading.cpp
16>PythonNetworkStreamPhaseLogin.cpp
16>PythonNetworkStreamPhaseOffline.cpp
16>PythonNetworkStreamPhaseSelect.cpp
16>PythonNonPlayer.cpp
16>PythonNonPlayerModule.cpp
16>PythonPackModule.cpp
16>PythonPlayer.cpp
16>PythonPlayerEventHandler.cpp
16>PythonPlayerInput.cpp
16>Compiling...
16>PythonPlayerInputKeyboard.cpp
16>PythonPlayerInputMouse.cpp
16>PythonPlayerModule.cpp
16>PythonPlayerSettingsModule.cpp
16>C:\Users\Admin\Desktop\Metin2\Source Binary Metin2\Binary\source\UserInterface\PythonPlayerSettingsModule.cpp(687,58): warning C4566: character represented by universal-character-name '\uC6B8' cannot be represented in the current code page (1252)
16>C:\Users\Admin\Desktop\Metin2\Source Binary Metin2\Binary\source\UserInterface\PythonPlayerSettingsModule.cpp(687,58): warning C4566: character represented by universal-character-name '\uC544' cannot be represented in the current code page (1252)
16>C:\Users\Admin\Desktop\Metin2\Source Binary Metin2\Binary\source\UserInterface\PythonPlayerSettingsModule.cpp(690,58): warning C4566: character represented by universal-character-name '\uC544' cannot be represented in the current code page (1252)
16>C:\Users\Admin\Desktop\Metin2\Source Binary Metin2\Binary\source\UserInterface\PythonPlayerSettingsModule.cpp(690,58): warning C4566: character represented by universal-character-name '\uC0AC' cannot be represented in the current code page (1252)
16>C:\Users\Admin\Desktop\Metin2\Source Binary Metin2\Binary\source\UserInterface\PythonPlayerSettingsModule.cpp(693,58): warning C4566: character represented by universal-character-name '\uD669' cannot be represented in the current code page (1252)
16>C:\Users\Admin\Desktop\Metin2\Source Binary Metin2\Binary\source\UserInterface\PythonPlayerSettingsModule.cpp(693,58): warning C4566: character represented by universal-character-name '\uB2F9' cannot be represented in the current code page (1252)
16>C:\Users\Admin\Desktop\Metin2\Source Binary Metin2\Binary\source\UserInterface\PythonPlayerSettingsModule.cpp(696,58): warning C4566: character represented by universal-character-name '\uD669' cannot be represented in the current code page (1252)
16>C:\Users\Admin\Desktop\Metin2\Source Binary Metin2\Binary\source\UserInterface\PythonPlayerSettingsModule.cpp(696,58): warning C4566: character represented by universal-character-name '\uB2F9' cannot be represented in the current code page (1252)
16>C:\Users\Admin\Desktop\Metin2\Source Binary Metin2\Binary\source\UserInterface\PythonPlayerSettingsModule.cpp(696,58): warning C4566: character represented by universal-character-name '\uC0AC' cannot be represented in the current code page (1252)
16>C:\Users\Admin\Desktop\Metin2\Source Binary Metin2\Binary\source\UserInterface\PythonPlayerSettingsModule.cpp(699,58): warning C4566: character represented by universal-character-name '\uD669' cannot be represented in the current code page (1252)
16>C:\Users\Admin\Desktop\Metin2\Source Binary Metin2\Binary\source\UserInterface\PythonPlayerSettingsModule.cpp(699,58): warning C4566: character represented by universal-character-name '\uC1A1' cannot be represented in the current code page (1252)
16>C:\Users\Admin\Desktop\Metin2\Source Binary Metin2\Binary\source\UserInterface\PythonPlayerSettingsModule.cpp(699,58): warning C4566: character represented by universal-character-name '\uC0AC' cannot be represented in the current code page (1252)
16>C:\Users\Admin\Desktop\Metin2\Source Binary Metin2\Binary\source\UserInterface\PythonPlayerSettingsModule.cpp(702,58): warning C4566: character represented by universal-character-name '\uD669' cannot be represented in the current code page (1252)
16>C:\Users\Admin\Desktop\Metin2\Source Binary Metin2\Binary\source\UserInterface\PythonPlayerSettingsModule.cpp(702,58): warning C4566: character represented by universal-character-name '\uC1A1' cannot be represented in the current code page (1252)
16>C:\Users\Admin\Desktop\Metin2\Source Binary Metin2\Binary\source\UserInterface\PythonPlayerSettingsModule.cpp(702,58): warning C4566: character represented by universal-character-name '\uC0AC' cannot be represented in the current code page (1252)
16>C:\Users\Admin\Desktop\Metin2\Source Binary Metin2\Binary\source\UserInterface\PythonPlayerSettingsModule.cpp(705,58): warning C4566: character represented by universal-character-name '\uC8C4' cannot be represented in the current code page (1252)
16>C:\Users\Admin\Desktop\Metin2\Source Binary Metin2\Binary\source\UserInterface\PythonPlayerSettingsModule.cpp(705,58): warning C4566: character represented by universal-character-name '\uC1A1' cannot be represented in the current code page (1252)
16>C:\Users\Admin\Desktop\Metin2\Source Binary Metin2\Binary\source\UserInterface\PythonPlayerSettingsModule.cpp(708,58): warning C4566: character represented by universal-character-name '\uAE30' cannot be represented in the current code page (1252)
16>C:\Users\Admin\Desktop\Metin2\Source Binary Metin2\Binary\source\UserInterface\PythonPlayerSettingsModule.cpp(708,58): warning C4566: character represented by universal-character-name '\uC068' cannot be represented in the current code page (1252)
16>C:\Users\Admin\Desktop\Metin2\Source Binary Metin2\Binary\source\UserInterface\PythonPlayerSettingsModule.cpp(711,58): warning C4566: character represented by universal-character-name '\uC6B8' cannot be represented in the current code page (1252)
16>C:\Users\Admin\Desktop\Metin2\Source Binary Metin2\Binary\source\UserInterface\PythonPlayerSettingsModule.cpp(711,58): warning C4566: character represented by universal-character-name '\uC544' cannot be represented in the current code page (1252)
16>C:\Users\Admin\Desktop\Metin2\Source Binary Metin2\Binary\source\UserInterface\PythonPlayerSettingsModule.cpp(714,58): warning C4566: character represented by universal-character-name '\uC544' cannot be represented in the current code page (1252)
16>C:\Users\Admin\Desktop\Metin2\Source Binary Metin2\Binary\source\UserInterface\PythonPlayerSettingsModule.cpp(714,58): warning C4566: character represented by universal-character-name '\uC0AC' cannot be represented in the current code page (1252)
16>C:\Users\Admin\Desktop\Metin2\Source Binary Metin2\Binary\source\UserInterface\PythonPlayerSettingsModule.cpp(717,58): warning C4566: character represented by universal-character-name '\uB3C8' cannot be represented in the current code page (1252)
16>C:\Users\Admin\Desktop\Metin2\Source Binary Metin2\Binary\source\UserInterface\PythonPlayerSettingsModule.cpp(717,58): warning C4566: character represented by universal-character-name '\uC0AC' cannot be represented in the current code page (1252)
16>C:\Users\Admin\Desktop\Metin2\Source Binary Metin2\Binary\source\UserInterface\PythonPlayerSettingsModule.cpp(720,58): warning C4566: character represented by universal-character-name '\uC544' cannot be represented in the current code page (1252)
16>C:\Users\Admin\Desktop\Metin2\Source Binary Metin2\Binary\source\UserInterface\PythonPlayerSettingsModule.cpp(720,58): warning C4566: character represented by universal-character-name '\uC88B' cannot be represented in the current code page (1252)
16>C:\Users\Admin\Desktop\Metin2\Source Binary Metin2\Binary\source\UserInterface\PythonPlayerSettingsModule.cpp(723,58): warning C4566: character represented by universal-character-name '\uB791' cannot be represented in the current code page (1252)
16>C:\Users\Admin\Desktop\Metin2\Source Binary Metin2\Binary\source\UserInterface\PythonPlayerSettingsModule.cpp(723,58): warning C4566: character represented by universal-character-name '\uC1A1' cannot be represented in the current code page (1252)
16>C:\Users\Admin\Desktop\Metin2\Source Binary Metin2\Binary\source\UserInterface\PythonPlayerSettingsModule.cpp(726,58): warning C4566: character represented by universal-character-name '\uB791' cannot be represented in the current code page (1252)
16>C:\Users\Admin\Desktop\Metin2\Source Binary Metin2\Binary\source\UserInterface\PythonPlayerSettingsModule.cpp(726,58): warning C4566: character represented by universal-character-name '\uC1A1' cannot be represented in the current code page (1252)
16>C:\Users\Admin\Desktop\Metin2\Source Binary Metin2\Binary\source\UserInterface\PythonPlayerSettingsModule.cpp(729,58): warning C4566: character represented by universal-character-name '\uB791' cannot be represented in the current code page (1252)
16>C:\Users\Admin\Desktop\Metin2\Source Binary Metin2\Binary\source\UserInterface\PythonPlayerSettingsModule.cpp(729,58): warning C4566: character represented by universal-character-name '\uC1A1' cannot be represented in the current code page (1252)
16>C:\Users\Admin\Desktop\Metin2\Source Binary Metin2\Binary\source\UserInterface\PythonPlayerSettingsModule.cpp(732,58): warning C4566: character represented by universal-character-name '\uC6B8' cannot be represented in the current code page (1252)
16>C:\Users\Admin\Desktop\Metin2\Source Binary Metin2\Binary\source\UserInterface\PythonPlayerSettingsModule.cpp(732,58): warning C4566: character represented by universal-character-name '\uC544' cannot be represented in the current code page (1252)
16>C:\Users\Admin\Desktop\Metin2\Source Binary Metin2\Binary\source\UserInterface\PythonPlayerSettingsModule.cpp(735,58): warning C4566: character represented by universal-character-name '\uD669' cannot be represented in the current code page (1252)
16>C:\Users\Admin\Desktop\Metin2\Source Binary Metin2\Binary\source\UserInterface\PythonPlayerSettingsModule.cpp(735,58): warning C4566: character represented by universal-character-name '\uB2F9' cannot be represented in the current code page (1252)
16>C:\Users\Admin\Desktop\Metin2\Source Binary Metin2\Binary\source\UserInterface\PythonPlayerSettingsModule.cpp(735,58): warning C4566: character represented by universal-character-name '\uC0AC' cannot be represented in the current code page (1252)
16>C:\Users\Admin\Desktop\Metin2\Source Binary Metin2\Binary\source\UserInterface\PythonPlayerSettingsModule.cpp(738,58): warning C4566: character represented by universal-character-name '\uC6B0' cannot be represented in the current code page (1252)
16>C:\Users\Admin\Desktop\Metin2\Source Binary Metin2\Binary\source\UserInterface\PythonPlayerSettingsModule.cpp(738,58): warning C4566: character represented by universal-character-name '\uC6B8' cannot be represented in the current code page (1252)
16>C:\Users\Admin\Desktop\Metin2\Source Binary Metin2\Binary\source\UserInterface\PythonPlayerSettingsModule.cpp(741,58): warning C4566: character represented by universal-character-name '\uC544' cannot be represented in the current code page (1252)
16>C:\Users\Admin\Desktop\Metin2\Source Binary Metin2\Binary\source\UserInterface\PythonPlayerSettingsModule.cpp(741,58): warning C4566: character represented by universal-character-name '\uB791' cannot be represented in the current code page (1252)
16>C:\Users\Admin\Desktop\Metin2\Source Binary Metin2\Binary\source\UserInterface\PythonPlayerSettingsModule.cpp(741,58): warning C4566: character represented by universal-character-name '\uC1A1' cannot be represented in the current code page (1252)
16>C:\Users\Admin\Desktop\Metin2\Source Binary Metin2\Binary\source\UserInterface\PythonPlayerSettingsModule.cpp(741,58): warning C4566: character represented by universal-character-name '\uC0AC' cannot be represented in the current code page (1252)
16>C:\Users\Admin\Desktop\Metin2\Source Binary Metin2\Binary\source\UserInterface\PythonPlayerSettingsModule.cpp(744,58): warning C4566: character represented by universal-character-name '\uC88B' cannot be represented in the current code page (1252)
16>C:\Users\Admin\Desktop\Metin2\Source Binary Metin2\Binary\source\UserInterface\PythonPlayerSettingsModule.cpp(744,58): warning C4566: character represented by universal-character-name '\uC544' cannot be represented in the current code page (1252)
16>C:\Users\Admin\Desktop\Metin2\Source Binary Metin2\Binary\source\UserInterface\PythonPlayerSettingsModule.cpp(747,58): warning C4566: character represented by universal-character-name '\uC0AC' cannot be represented in the current code page (1252)
16>C:\Users\Admin\Desktop\Metin2\Source Binary Metin2\Binary\source\UserInterface\PythonPlayerSettingsModule.cpp(747,58): warning C4566: character represented by universal-character-name '\uC88B' cannot be represented in the current code page (1252)
16>C:\Users\Admin\Desktop\Metin2\Source Binary Metin2\Binary\source\UserInterface\PythonPlayerSettingsModule.cpp(750,58): warning C4566: character represented by universal-character-name '\uB791' cannot be represented in the current code page (1252)
16>C:\Users\Admin\Desktop\Metin2\Source Binary Metin2\Binary\source\UserInterface\PythonPlayerSettingsModule.cpp(750,58): warning C4566: character represented by universal-character-name '\uC0AC' cannot be represented in the current code page (1252)
16>C:\Users\Admin\Desktop\Metin2\Source Binary Metin2\Binary\source\UserInterface\PythonPlayerSettingsModule.cpp(753,58): warning C4566: character represented by universal-character-name '\uD669' cannot be represented in the current code page (1252)
16>C:\Users\Admin\Desktop\Metin2\Source Binary Metin2\Binary\source\UserInterface\PythonPlayerSettingsModule.cpp(753,58): warning C4566: character represented by universal-character-name '\uB2F9' cannot be represented in the current code page (1252)
16>C:\Users\Admin\Desktop\Metin2\Source Binary Metin2\Binary\source\UserInterface\PythonPlayerSettingsModule.cpp(753,58): warning C4566: character represented by universal-character-name '\uC0AC' cannot be represented in the current code page (1252)
16>C:\Users\Admin\Desktop\Metin2\Source Binary Metin2\Binary\source\UserInterface\PythonPlayerSettingsModule.cpp(756,58): warning C4566: character represented by universal-character-name '\uD669' cannot be represented in the current code page (1252)
16>C:\Users\Admin\Desktop\Metin2\Source Binary Metin2\Binary\source\UserInterface\PythonPlayerSettingsModule.cpp(756,58): warning C4566: character represented by universal-character-name '\uC88B' cannot be represented in the current code page (1252)
16>C:\Users\Admin\Desktop\Metin2\Source Binary Metin2\Binary\source\UserInterface\PythonPlayerSettingsModule.cpp(756,58): warning C4566: character represented by universal-character-name '\uC0AC' cannot be represented in the current code page (1252)
16>C:\Users\Admin\Desktop\Metin2\Source Binary Metin2\Binary\source\UserInterface\PythonPlayerSettingsModule.cpp(756,58): warning C4566: character represented by universal-character-name '\uB2F9' cannot be represented in the current code page (1252)
16>C:\Users\Admin\Desktop\Metin2\Source Binary Metin2\Binary\source\UserInterface\PythonPlayerSettingsModule.cpp(759,58): warning C4566: character represented by universal-character-name '\uC8C4' cannot be represented in the current code page (1252)
16>C:\Users\Admin\Desktop\Metin2\Source Binary Metin2\Binary\source\UserInterface\PythonPlayerSettingsModule.cpp(759,58): warning C4566: character represented by universal-character-name '\uC0AC' cannot be represented in the current code page (1252)
16>C:\Users\Admin\Desktop\Metin2\Source Binary Metin2\Binary\source\UserInterface\PythonPlayerSettingsModule.cpp(759,58): warning C4566: character represented by universal-character-name '\uC1A1' cannot be represented in the current code page (1252)
16>C:\Users\Admin\Desktop\Metin2\Source Binary Metin2\Binary\source\UserInterface\PythonPlayerSettingsModule.cpp(762,58): warning C4566: character represented by universal-character-name '\uC1A1' cannot be represented in the current code page (1252)
16>C:\Users\Admin\Desktop\Metin2\Source Binary Metin2\Binary\source\UserInterface\PythonPlayerSettingsModule.cpp(762,58): warning C4566: character represented by universal-character-name '\uB791' cannot be represented in the current code page (1252)
16>C:\Users\Admin\Desktop\Metin2\Source Binary Metin2\Binary\source\UserInterface\PythonPlayerSettingsModule.cpp(765,58): warning C4566: character represented by universal-character-name '\uC1A1' cannot be represented in the current code page (1252)
16>C:\Users\Admin\Desktop\Metin2\Source Binary Metin2\Binary\source\UserInterface\PythonPlayerSettingsModule.cpp(765,58): warning C4566: character represented by universal-character-name '\uB791' cannot be represented in the current code page (1252)
16>C:\Users\Admin\Desktop\Metin2\Source Binary Metin2\Binary\source\UserInterface\PythonPlayerSettingsModule.cpp(765,58): warning C4566: character represented by universal-character-name '\uC0AC' cannot be represented in the current code page (1252)
16>C:\Users\Admin\Desktop\Metin2\Source Binary Metin2\Binary\source\UserInterface\PythonPlayerSettingsModule.cpp(768,58): warning C4566: character represented by universal-character-name '\uB791' cannot be represented in the current code page (1252)
16>C:\Users\Admin\Desktop\Metin2\Source Binary Metin2\Binary\source\UserInterface\PythonPlayerSettingsModule.cpp(768,58): warning C4566: character represented by universal-character-name '\uC544' cannot be represented in the current code page (1252)
16>C:\Users\Admin\Desktop\Metin2\Source Binary Metin2\Binary\source\UserInterface\PythonPlayerSettingsModule.cpp(771,58): warning C4566: character represented by universal-character-name '\uC0AC' cannot be represented in the current code page (1252)
16>C:\Users\Admin\Desktop\Metin2\Source Binary Metin2\Binary\source\UserInterface\PythonPlayerSettingsModule.cpp(771,58): warning C4566: character represented by universal-character-name '\uC544' cannot be represented in the current code page (1252)
16>C:\Users\Admin\Desktop\Metin2\Source Binary Metin2\Binary\source\UserInterface\PythonPlayerSettingsModule.cpp(774,58): warning C4566: character represented by universal-character-name '\uC0AC' cannot be represented in the current code page (1252)
16>C:\Users\Admin\Desktop\Metin2\Source Binary Metin2\Binary\source\UserInterface\PythonPlayerSettingsModule.cpp(774,58): warning C4566: character represented by universal-character-name '\uB3C8' cannot be represented in the current code page (1252)
16>C:\Users\Admin\Desktop\Metin2\Source Binary Metin2\Binary\source\UserInterface\PythonPlayerSettingsModule.cpp(777,58): warning C4566: character represented by universal-character-name '\uC544' cannot be represented in the current code page (1252)
16>C:\Users\Admin\Desktop\Metin2\Source Binary Metin2\Binary\source\UserInterface\PythonPlayerSettingsModule.cpp(777,58): warning C4566: character represented by universal-character-name '\uC1A1' cannot be represented in the current code page (1252)
16>C:\Users\Admin\Desktop\Metin2\Source Binary Metin2\Binary\source\UserInterface\PythonPlayerSettingsModule.cpp(780,58): warning C4566: character represented by universal-character-name '\uC544' cannot be represented in the current code page (1252)
16>C:\Users\Admin\Desktop\Metin2\Source Binary Metin2\Binary\source\UserInterface\PythonPlayerSettingsModule.cpp(780,58): warning C4566: character represented by universal-character-name '\uC6B8' cannot be represented in the current code page (1252)
16>C:\Users\Admin\Desktop\Metin2\Source Binary Metin2\Binary\source\UserInterface\PythonPlayerSettingsModule.cpp(780,58): warning C4566: character represented by universal-character-name '\uB3C8' cannot be represented in the current code page (1252)
16>C:\Users\Admin\Desktop\Metin2\Source Binary Metin2\Binary\source\UserInterface\PythonPlayerSettingsModule.cpp(783,58): warning C4566: character represented by universal-character-name '\uC8C4' cannot be represented in the current code page (1252)
16>C:\Users\Admin\Desktop\Metin2\Source Binary Metin2\Binary\source\UserInterface\PythonPlayerSettingsModule.cpp(783,58): warning C4566: character represented by universal-character-name '\uC1A1' cannot be represented in the current code page (1252)
16>C:\Users\Admin\Desktop\Metin2\Source Binary Metin2\Binary\source\UserInterface\PythonPlayerSettingsModule.cpp(786,58): warning C4566: character represented by universal-character-name '\uC8C4' cannot be represented in the current code page (1252)
16>C:\Users\Admin\Desktop\Metin2\Source Binary Metin2\Binary\source\UserInterface\PythonPlayerSettingsModule.cpp(786,58): warning C4566: character represented by universal-character-name '\uC1A1' cannot be represented in the current code page (1252)
16>C:\Users\Admin\Desktop\Metin2\Source Binary Metin2\Binary\source\UserInterface\PythonPlayerSettingsModule.cpp(789,58): warning C4566: character represented by universal-character-name '\uB2F9' cannot be represented in the current code page (1252)
16>C:\Users\Admin\Desktop\Metin2\Source Binary Metin2\Binary\source\UserInterface\PythonPlayerSettingsModule.cpp(789,58): warning C4566: character represented by universal-character-name '\uC0AC' cannot be represented in the current code page (1252)
16>C:\Users\Admin\Desktop\Metin2\Source Binary Metin2\Binary\source\UserInterface\PythonPlayerSettingsModule.cpp(792,58): warning C4566: character represented by universal-character-name '\uC1A1' cannot be represented in the current code page (1252)
16>C:\Users\Admin\Desktop\Metin2\Source Binary Metin2\Binary\source\UserInterface\PythonPlayerSettingsModule.cpp(792,58): warning C4566: character represented by universal-character-name '\uB2F9' cannot be represented in the current code page (1252)
16>C:\Users\Admin\Desktop\Metin2\Source Binary Metin2\Binary\source\UserInterface\PythonPlayerSettingsModule.cpp(795,58): warning C4566: character represented by universal-character-name '\uC1A1' cannot be represented in the current code page (1252)
16>C:\Users\Admin\Desktop\Metin2\Source Binary Metin2\Binary\source\UserInterface\PythonPlayerSettingsModule.cpp(795,58): warning C4566: character represented by universal-character-name '\uB2F9' cannot be represented in the current code page (1252)
16>C:\Users\Admin\Desktop\Metin2\Source Binary Metin2\Binary\source\UserInterface\PythonPlayerSettingsModule.cpp(795,58): warning C4566: character represented by universal-character-name '\uC0AC' cannot be represented in the current code page (1252)
16>C:\Users\Admin\Desktop\Metin2\Source Binary Metin2\Binary\source\UserInterface\PythonPlayerSettingsModule.cpp(798,58): warning C4566: character represented by universal-character-name '\uC0AC' cannot be represented in the current code page (1252)
16>C:\Users\Admin\Desktop\Metin2\Source Binary Metin2\Binary\source\UserInterface\PythonPlayerSettingsModule.cpp(798,58): warning C4566: character represented by universal-character-name '\uC544' cannot be represented in the current code page (1252)
16>C:\Users\Admin\Desktop\Metin2\Source Binary Metin2\Binary\source\UserInterface\PythonPlayerSettingsModule.cpp(798,58): warning C4566: character represented by universal-character-name '\uB2F9' cannot be represented in the current code page (1252)
16>C:\Users\Admin\Desktop\Metin2\Source Binary Metin2\Binary\source\UserInterface\PythonPlayerSettingsModule.cpp(801,58): warning C4566: character represented by universal-character-name '\uC544' cannot be represented in the current code page (1252)
16>C:\Users\Admin\Desktop\Metin2\Source Binary Metin2\Binary\source\UserInterface\PythonPlayerSettingsModule.cpp(801,58): warning C4566: character represented by universal-character-name '\uB3C8' cannot be represented in the current code page (1252)
16>C:\Users\Admin\Desktop\Metin2\Source Binary Metin2\Binary\source\UserInterface\PythonPlayerSettingsModule.cpp(804,58): warning C4566: character represented by universal-character-name '\uB3C8' cannot be represented in the current code page (1252)
16>C:\Users\Admin\Desktop\Metin2\Source Binary Metin2\Binary\source\UserInterface\PythonPlayerSettingsModule.cpp(804,58): warning C4566: character represented by universal-character-name '\uC8C4' cannot be represented in the current code page (1252)
16>C:\Users\Admin\Desktop\Metin2\Source Binary Metin2\Binary\source\UserInterface\PythonPlayerSettingsModule.cpp(807,58): warning C4566: character represented by universal-character-name '\uC8C4' cannot be represented in the current code page (1252)
16>C:\Users\Admin\Desktop\Metin2\Source Binary Metin2\Binary\source\UserInterface\PythonPlayerSettingsModule.cpp(807,58): warning C4566: character represented by universal-character-name '\uB2F9' cannot be represented in the current code page (1252)
16>C:\Users\Admin\Desktop\Metin2\Source Binary Metin2\Binary\source\UserInterface\PythonPlayerSettingsModule.cpp(807,58): warning C4566: character represented by universal-character-name '\uC0AC' cannot be represented in the current code page (1252)
16>C:\Users\Admin\Desktop\Metin2\Source Binary Metin2\Binary\source\UserInterface\PythonPlayerSettingsModule.cpp(810,58): warning C4566: character represented by universal-character-name '\uB3C8' cannot be represented in the current code page (1252)
16>C:\Users\Admin\Desktop\Metin2\Source Binary Metin2\Binary\source\UserInterface\PythonPlayerSettingsModule.cpp(810,58): warning C4566: character represented by universal-character-name '\uC0AC' cannot be represented in the current code page (1252)
16>C:\Users\Admin\Desktop\Metin2\Source Binary Metin2\Binary\source\UserInterface\PythonPlayerSettingsModule.cpp(813,58): warning C4566: character represented by universal-character-name '\uB3C8' cannot be represented in the current code page (1252)
16>C:\Users\Admin\Desktop\Metin2\Source Binary Metin2\Binary\source\UserInterface\PythonPlayerSettingsModule.cpp(813,58): warning C4566: character represented by universal-character-name '\uC544' cannot be represented in the current code page (1252)
16>C:\Users\Admin\Desktop\Metin2\Source Binary Metin2\Binary\source\UserInterface\PythonPlayerSettingsModule.cpp(816,58): warning C4566: character represented by universal-character-name '\uC544' cannot be represented in the current code page (1252)
16>C:\Users\Admin\Desktop\Metin2\Source Binary Metin2\Binary\source\UserInterface\PythonPlayerSettingsModule.cpp(816,58): warning C4566: character represented by universal-character-name '\uB2F9' cannot be represented in the current code page (1252)
16>PythonPlayerSkill.cpp
16>PythonProfilerModule.cpp
16>PythonQuest.cpp
16>PythonSafeBox.cpp
16>PythonShop.cpp
16>PythonSkill.cpp
16>PythonSoundManagerModule.cpp
16>PythonSwitchbot.cpp
16>PythonSystem.cpp
16>PythonSystemModule.cpp
16>PythonTextTail.cpp
16>CCpuId.cpp
16>CHddData.cpp
16>CMacAddr.cpp
16>CMachineGuid.cpp
16>CNetworkAdapter.cpp
16>Compiling...
16>PythonTextTailModule.cpp
16>ServerStateChecker.cpp
16>ServerStateCheckerModule.cpp
16>UserInterface.cpp
16>C:\Users\Admin\Desktop\Metin2\Source Binary Metin2\Binary\source\UserInterface\minIni.cpp(40,1): warning C4005: 'assert': macro redefinition
16>C:\Program Files (x86)\Windows Kits\10\Include\10.0.19041.0\ucrt\assert.h(26): message : see previous definition of 'assert'
16>WiseLogicXTrap.cpp
16>Done building project "UserInterface.vcxproj" -- FAILED.
========== Build: 15 succeeded, 1 failed, 0 up-to-date, 0 skipped ==========
Avatar utilizator
RaulM
Nivel 1

Nivel 1
Mesaje: 54
Membru din: 19 Feb 2023, 20:53
Regat: Shinsoo
Aprecieri: 3  
Mulţumiri: 3  
  Rezolvări prob.: 3
Medalii

Pai vezi ca ai ratat ceva in pythonNetworkStream.cpp
Arata-mi liniile de cod de acolo .

Cod: Selectaţi tot

16>C:\Users\Admin\Desktop\Metin2\Source Binary Metin2\Binary\source\UserInterface\PythonNetworkStream.cpp(967,2): error C2059: syntax error: 'else'
16>C:\Users\Admin\Desktop\Metin2\Source Binary Metin2\Binary\source\UserInterface\PythonNetworkStream.cpp(969,1): error C2059: syntax error: '}'
16>C:\Users\Admin\Desktop\Metin2\Source Binary Metin2\Binary\source\UserInterface\PythonNetworkStream.cpp(969,1): error C2143: syntax error: missing ';' before '}'
16>C:\Users\Admin\Desktop\Metin2\Source Binary Metin2\Binary\source\UserInterface\PythonNetworkStream.cpp(972,1): error C2143: syntax error: missing ';' before '{'
16>C:\Users\Admin\Desktop\Metin2\Source Binary Metin2\Binary\source\UserInterface\PythonNetworkStream.cpp(972,1): error C2447: '{': missing function header (old-style formal list?)
Avatar utilizator
DMG
Membru Club

Membru Club
Mesaje: 632
Membru din: 24 Iun 2017, 14:59
Server: Metin2Haha.ro
Regat: Jinno
Aprecieri: 415  
Mulţumiri: 454  
Medalii

RaulM scrie: ↑08 Apr 2023, 16:34 Pai vezi ca ai ratat ceva in pythonNetworkStream.cpp
Arata-mi liniile de cod de acolo .

Cod: Selectaţi tot

16>C:\Users\Admin\Desktop\Metin2\Source Binary Metin2\Binary\source\UserInterface\PythonNetworkStream.cpp(967,2): error C2059: syntax error: 'else'
16>C:\Users\Admin\Desktop\Metin2\Source Binary Metin2\Binary\source\UserInterface\PythonNetworkStream.cpp(969,1): error C2059: syntax error: '}'
16>C:\Users\Admin\Desktop\Metin2\Source Binary Metin2\Binary\source\UserInterface\PythonNetworkStream.cpp(969,1): error C2143: syntax error: missing ';' before '}'
16>C:\Users\Admin\Desktop\Metin2\Source Binary Metin2\Binary\source\UserInterface\PythonNetworkStream.cpp(972,1): error C2143: syntax error: missing ';' before '{'
16>C:\Users\Admin\Desktop\Metin2\Source Binary Metin2\Binary\source\UserInterface\PythonNetworkStream.cpp(972,1): error C2447: '{': missing function header (old-style formal list?)
A ratat mai multe, cred ca a vrut sa adauge sau sa stearga ceva de prin sursa si a uitat ceva lucruri

Cod: Selectaţi tot

16>C:\Users\Admin\Desktop\Metin2\Source Binary Metin2\Binary\source\UserInterface\InstanceBase.cpp(817,3): error C3861: 'SetAcce': identifier not found
16>C:\Users\Admin\Desktop\Metin2\Source Binary Metin2\Binary\source\UserInterface\InstanceBase.cpp(818,23): error C2065: 'CHR_SHINING_NUM': undeclared identifier
16>C:\Users\Admin\Desktop\Metin2\Source Binary Metin2\Binary\source\UserInterface\InstanceBase.cpp(819,4): error C3861: 'SetShining': identifier not found
16>C:\Users\Admin\Desktop\Metin2\Source Binary Metin2\Binary\source\UserInterface\InstanceBase.cpp(3142,58): error C2065: 'pItemData': undeclared identifier
16>C:\Users\Admin\Desktop\Metin2\Source Binary Metin2\Binary\source\UserInterface\InstanceBase.cpp(3144,24): error C2065: 'pItemData': undeclared identifier
Imagine
Afișează semnătura
Avatar utilizator
Mexys
Nou Venit

Nou Venit
Mesaje: 15
Membru din: 30 Oct 2022, 01:03
Regat: Shinsoo
Aprecieri: 0
Mulţumiri: 0
Medalii

Sincer nu am modificat nimic, am vrut doar sa vad daca compileaza.
Avatar utilizator
Wizzard
Utilizator neserios / Untrustworthy user !

Utilizator neserios / Untrustworthy user !
Mesaje: 901
Membru din: 05 Iul 2021, 13:37
Server: 911.Projects
Regat: Chunjo
Aprecieri: 525  
Mulţumiri: 3420  
Discord: Copiază ID
 Contact:
Medalii

Subiect vechi T/C
Închis
Răspunsuri
3
Vizualizări
294
Răspunsuri
1
Vizualizări
246
Răspunsuri
0
Vizualizări
50
Răspunsuri
4
Vizualizări
256

Înapoi la “Arhivă Probleme şi Întrebări”

  • Informaţie
  • Cine este conectat

    Utilizatori ce ce navighează pe acest forum: Niciun utilizator înregistrat și 29 vizitatori