*Problemă/Întrebare: Eroare compilare a game-ului eren3
Tipologie server:pvm
*Resursă folosită: svf-pentru-resurse/serverfiles-sursa-eren3-t100615.html
*ServerFiles utilizat: eren3
*Syserr: compiling main.cpp
linking ../game_r41019
/usr/local/bin/ld: /usr/local/lib/mysql/libmysqlclient.a(my_aes_openssl.cc.o): undefined reference to symbol 'EVP_aes_128_cfb1'
/usr/local/bin/ld: /lib/libcrypto.so.8: error adding symbols: DSO missing from command line
collect2: error: ld returned 1 exit status
gmake: *** [Makefile:276: ../game_r41019] Error 1
Poză:https://i.postimg.cc/CKmD7CmH/Screenshot-1.png
*Detalii suplimentare:Am acea eroare la compilare, nu prea am gasit multe pe net legat de asta, am vazut ceva legat de un diff dar nu stiu cum sa il folosesc. Si nici mysql nu functioneaza, am mysql56, nu porneste.
aici am pus err
problema compilare game eren3
-
- Informaţie
-
Cine este conectat
Utilizatori ce ce navighează pe acest forum: Baidu [Spider] și 80 vizitatori
