Mă poate ajuta și pe mine cineva cu aceste errori ?
16> PythonSkillPet.cpp
16>PythonSkillPet.cpp(5): error C2653: 'PythonSkillPet' : is not a class or namespace name
16>PythonSkillPet.cpp(6): error C4430: missing type specifier - int assumed. Note: C++ does not support default-int
16>PythonSkillPet.cpp(7): warning C4508: 'PythonSkillPet' : function should return a value; 'void' return type assumed
16>PythonSkillPet.cpp(10): error C2653: 'PythonSkillPet' : is not a class or namespace name
16>PythonSkillPet.cpp(10): fatal error C1903: unable to recover from previous error(s); stopping compilation
========== Rebuild All: 15 succeeded, 1 failed, 0 skipped ==========
Problema compilare pythonskillpets
Răspunsuri
1 Vizualizări
373
1 Vizualizări
373
-
- Informaţie
-
Cine este conectat
Utilizatori ce ce navighează pe acest forum: Niciun utilizator înregistrat și 61 vizitatori


