Tipologie server: Pvm-Pvp
*Resursă folosită: https://github.com/ZeNu-Elijah/Metin2/t ... stem%200.1
*ServerFiles utilizat: serverfiles/serverfiles-clean-src-t67971.html
*Syserr: In file included from char.cpp:65:
MountSystem.h:88:7: warning: no newline at end of file
char.cpp:8559:7: warning: no newline at end of file
[Compilat] char_change_empire.cpp
[Compilat] char_horse.cpp
[Compilat] char_item.cpp
[Compilat] char_manager.cpp
[Compilat] char_quickslot.cpp
[Compilat] char_resist.cpp
char.cpp: In member function 'void CHARACTER::ComputePoints()':
char.cpp
[Compilat] char_skill.cpp
char.cpp: In member function 'void CHARACTER::CheckMount()':
char.cpp:8526: error: 'WEAR_COSTUME_MOUNT' was not declared in this scope
char.cpp: In member function 'bool CHARACTER::IsRidingMount()':
char.cpp:8557: error: 'WEAR_COSTUME_MOUNT' was not declared in this scope
[Compilat] char_state.cpp
[Compilat] PetSystem.cpp
gmake: *** [OBJDIR/char.o] Error 1
gmake: *** Waiting for unfinished jobs....
char_item.cpp: In member function 'bool CHARACTER::EquipItem(CItem*, int)':
char_item.cpp:6308: error: a function-definition is not allowed here before '{' token
char_item.cpp:7651: error: expected `}' at end of input
char_item.cpp: At global scope:
char_item.cpp:170: warning: 'bool FN_check_item_socket(CItem*)' defined but not used
gmake: *** [OBJDIR/char_item.o] Error 1
Poză:
*Detalii suplimentare: https://file.io/PwPOEOY9QqBk - acestea sunt modificările făcute de mine după resursa folosită.






