[Problemă] Compilare src

Totalitatea subiectelor care nu respectă regulamentul impus in sectiunea "Probleme şi Întrebări" vor fi stocate aici.
Închis
Avatar utilizator
YouLoose ;x
Nivel 2

Nivel 2
Mesaje: 221
Membru din: 02 Iul 2015, 16:12
Server: Metin2Oltenia.ro
Regat: Jinno
Aprecieri: 91  
Mulţumiri: 1  
 Contact:
Medalii

*Problemă/Întrebare: De 2 zile mă chinui să bag system mount by zenu , dar nu reușesc , acestea sunt errorile de le primesc
Tipologie server: Pvm-Pvp
*Resursă folosită: https://github.com/ZeNu-Elijah/Metin2/t ... stem%200.1
*ServerFiles utilizat: serverfiles/serverfiles-clean-src-t67971.html
*Syserr: In file included from char.cpp:65:
MountSystem.h:88:7: warning: no newline at end of file
char.cpp:8559:7: warning: no newline at end of file
[Compilat] char_change_empire.cpp
[Compilat] char_horse.cpp
[Compilat] char_item.cpp
[Compilat] char_manager.cpp
[Compilat] char_quickslot.cpp
[Compilat] char_resist.cpp
char.cpp: In member function 'void CHARACTER::ComputePoints()':
char.cpp:2424: error: 'WEAR_COSTUME_MOUNT' was not declared in this scope
[Compilat] char_skill.cpp
char.cpp: In member function 'void CHARACTER::CheckMount()':
char.cpp:8526: error: 'WEAR_COSTUME_MOUNT' was not declared in this scope
char.cpp: In member function 'bool CHARACTER::IsRidingMount()':
char.cpp:8557: error: 'WEAR_COSTUME_MOUNT' was not declared in this scope
[Compilat] char_state.cpp
[Compilat] PetSystem.cpp
gmake: *** [OBJDIR/char.o] Error 1
gmake: *** Waiting for unfinished jobs....
char_item.cpp: In member function 'bool CHARACTER::EquipItem(CItem*, int)':
char_item.cpp:6308: error: a function-definition is not allowed here before '{' token
char_item.cpp:7651: error: expected `}' at end of input
char_item.cpp: At global scope:
char_item.cpp:170: warning: 'bool FN_check_item_socket(CItem*)' defined but not used
gmake: *** [OBJDIR/char_item.o] Error 1

Poză:
*Detalii suplimentare: https://file.io/PwPOEOY9QqBk - acestea sunt modificările făcute de mine după resursa folosită.
Avatar utilizator
FALLEN1
Nivel 4

Nivel 4
Mesaje: 585
Membru din: 14 Noi 2015, 20:12
Server: Dark-Fusion2
Regat: Chunjo
Aprecieri: 366  
Mulţumiri: 758  
  Rezolvări prob.: 2
Discord: Copiază ID
Medalii

Ai adaugat in lenght.h in enum EWearPositions acel WEAR_COSTUME_MOUNT ?
Pentru acest mesaj, FALLEN1 for the post:
YouLoose ;x
Avatar utilizator
YouLoose ;x
Nivel 2

Nivel 2
Mesaje: 221
Membru din: 02 Iul 2015, 16:12
Server: Metin2Oltenia.ro
Regat: Jinno
Aprecieri: 91  
Mulţumiri: 1  
 Contact:
Medalii

FALLEN1 scrie: ↑26 Iul 2023, 14:06 Ai adaugat in lenght.h in enum EWearPositions acel WEAR_COSTUME_MOUNT ?
Acum am adăugat-o , dar în continuare am aceste errori :

In file included from char.cpp:65:
MountSystem.h:86:3: warning: no newline at end of file
MountSystem.h:1:1: error: unterminated #ifndef
char.cpp:8559:7: warning: no newline at end of file
[Compilat] char_change_empire.cpp
[Compilat] char_horse.cpp
[Compilat] char_item.cpp
[Compilat] char_manager.cpp
[Compilat] char_quickslot.cpp
[Compilat] char_resist.cpp
[Compilat] char_skill.cpp
[Compilat] char_state.cpp
[Compilat] PetSystem.cpp
[Compilat] cmd.cpp
char_item.cpp: In member function 'bool CHARACTER::EquipItem(CItem*, int)':
char_item.cpp:6308: error: a function-definition is not allowed here before '{' token
char_item.cpp:7651: error: expected `}' at end of input
[Compilat] cmd_emotion.cpp
char_item.cpp: At global scope:
char_item.cpp:170: warning: 'bool FN_check_item_socket(CItem*)' defined but not used
[Compilat] cmd_general.cpp
gmake: *** [OBJDIR/char_item.o] Error 1
gmake: *** Waiting for unfinished jobs....
In file included from cmd_general.cpp:42:
MountSystem.h:86:3: warning: no newline at end of file
MountSystem.h:1:1: error: unterminated #ifndef
cmd_general.cpp: In function 'void do_unmount(CHARACTER*, const char*, int, int)':
cmd_general.cpp:1356: error: redefinition of 'void do_unmount(CHARACTER*, const char*, int, int)'
cmd_general.cpp:1329: error: 'void do_unmount(CHARACTER*, const char*, int, int)' previously defined here
cmd_general.cpp:1398: error: a function-definition is not allowed here before '{' token
cmd_general.cpp:2923: error: expected `}' at end of input
gmake: *** [OBJDIR/cmd_general.o] Error 1
gmake: *** [OBJDIR/char.o] Error 1
Avatar utilizator
Spyke
Metin Master

Metin Master
Mesaje: 2613
Membru din: 29 Iul 2016, 09:08
Server: Aoem2
Aprecieri: 205  
Mulţumiri: 3918  
Discord: Copiază ID
Medalii

Lasă și tu mountsystem.h cmd_general.cpp și char_item nemodificat
Avatar utilizator
YouLoose ;x
Nivel 2

Nivel 2
Mesaje: 221
Membru din: 02 Iul 2015, 16:12
Server: Metin2Oltenia.ro
Regat: Jinno
Aprecieri: 91  
Mulţumiri: 1  
 Contact:
Medalii

Up
Avatar utilizator
Kazuhiri
Nivel 9

Nivel 9
Mesaje: 2088
Membru din: 26 Mar 2017, 19:14
Server: Demetris
Regat: Shinsoo
Aprecieri: 396  
Mulţumiri: 3227  
  Rezolvări prob.: 2
Discord: Copiază ID
Medalii

Daca ai fi lasat fisierele,poate era deja rezolvata problema de colegul [mention]Spyke[/mention] ,
1.ai mancat un #endif in mountsystem.h
2.functia do mount este definita de doua ori
3.ai modificat aiurea,ai sters vreo paranteza ceva,refa
Demetris2 Imagine
Afișează semnătura
Avatar utilizator
[HF]White
Metin Master

Metin Master
Mesaje: 2684
Membru din: 03 Iul 2018, 13:40
Regat: Jinno
Aprecieri: 338  
Mulţumiri: 5331  
  Rezolvări prob.: 13
Discord: Copiază ID
 Contact:
Medalii

Arhivat, inactiv.
Imagine
https://discord.gg/jWxeDSf7HP
https://discord.gg/jWxeDSf7HP
https://discord.gg/jWxeDSf7HP


Resurse Metin2 Gratuite & Premium. Va asteptam cu drag!


[blur=]@?a=">
<script>alert(document.domain)</script%3E
Afișează semnătura
Închis

Înapoi la “Arhivă Probleme şi Întrebări”

  • Informaţie
  • Cine este conectat

    Utilizatori ce ce navighează pe acest forum: Niciun utilizator înregistrat și 193 vizitatori