Asta e la DB!
Cod: Selectaţi tot
In file included from NetBase.cpp:4:
ClientManager.h:35: error: 'boost' has not been declared
ClientManager.h:35: error: ISO C++ forbids declaration of 'unordered_map' with no type
ClientManager.h:35: error: typedef name may not be a nested-name-specifier
ClientManager.h:35: error: expected ';' before '<' token
ClientManager.h:36: error: 'boost' has not been declared
ClientManager.h:36: error: ISO C++ forbids declaration of 'unordered_map' with no type
ClientManager.h:36: error: typedef name may not be a nested-name-specifier
ClientManager.h:36: error: expected ';' before '<' token
ClientManager.h:37: error: 'boost' has not been declared
ClientManager.h:37: error: ISO C++ forbids declaration of 'unordered_set' with no type
ClientManager.h:37: error: typedef name may not be a nested-name-specifier
ClientManager.h:37: error: expected ';' before '<' token
ClientManager.h:38: error: 'boost' has not been declared
ClientManager.h:38: error: ISO C++ forbids declaration of 'unordered_map' with no type
ClientManager.h:38: error: typedef name may not be a nested-name-specifier
ClientManager.h:38: error: expected ';' before '<' token
ClientManager.h:39: error: 'boost' has not been declared
ClientManager.h:39: error: ISO C++ forbids declaration of 'unordered_map' with no type
ClientManager.h:39: error: typedef name may not be a nested-name-specifier
ClientManager.h:39: error: expected ';' before '<' token
ClientManager.h:40: error: 'boost' has not been declared
ClientManager.h:40: error: ISO C++ forbids declaration of 'unordered_map' with no type
ClientManager.h:40: error: typedef name may not be a nested-name-specifier
ClientManager.h:40: error: expected ';' before '<' token
ClientManager.h:120: error: ISO C++ forbids declaration of 'TItemCacheSet' with no type
ClientManager.h:120: error: expected ';' before '*' token
ClientManager.h:395: error: 'boost' has not been declared
ClientManager.h:395: error: ISO C++ forbids declaration of 'unordered_map' with no type
ClientManager.h:395: error: typedef name may not be a nested-name-specifier
ClientManager.h:395: error: expected ';' before '<' token
ClientManager.h:396: error: 'TLoginDataByLoginKey' does not name a type
ClientManager.h:399: error: 'boost' has not been declared
ClientManager.h:399: error: ISO C++ forbids declaration of 'unordered_map' with no type
ClientManager.h:399: error: typedef name may not be a nested-name-specifier
ClientManager.h:399: error: expected ';' before '<' token
ClientManager.h:400: error: 'TLoginDataByLogin' does not name a type
ClientManager.h:403: error: 'boost' has not been declared
ClientManager.h:403: error: ISO C++ forbids declaration of 'unordered_map' with no type
ClientManager.h:403: error: typedef name may not be a nested-name-specifier
ClientManager.h:403: error: expected ';' befși asta la game.
Cod: Selectaţi tot
[Ares2 - OK] Compilare: BattleArena.cpp
[Ares2 - OK] Compilare: FSM.cpp
In file included from stdafx.h:39,
from BattleArena.cpp:1:
event.h:10:35: error: boost/intrusive_ptr.hpp: No such file or directory
In file included from BattleArena.cpp:6:
char.h:4:35: error: boost/unordered_map.hpp: No such file or directory
[Ares2 - OK] Compilare: MarkConvert.cpp
In file included from stdafx.h:39,
from BattleArena.cpp:1:
event.h:37: error: 'boost' has not been declared
event.h:37: error: expected initializer before '<' token
event.h:38: error: typedef 'TEVENTFUNC' is initialized (use __typeof__ instead)
event.h:38: error: 'LPEVENT' was not declared in this scope
event.h:38: error: expected primary-expression before 'long'
event.h:57: error: 'TEVENTFUNC' does not name a type
event.h: In constructor 'event::event()':
event.h:47: error: class 'event' does not have any field named 'func'
event.h: At global scope:
event.h:83: error: 'LPEVENT' does not name a type
event.h:84: warning: 'event_cancel' initialized and declared 'extern'
event.h:84: error: variable or field 'event_cancel' declared void
event.h:84: error: 'LPEVENT' was not declared in this scope
event.h:84: error: expected primary-expression before ')' token
event.h:85: warning: 'event_processing_time' initialized and declared 'extern'
event.h:85: error: 'LPEVENT' was not declared in this scope
event.h:86: warning: 'event_time' initialized and declared 'extern'
event.h:86: error: 'LPEVENT' was not declared in this scope
event.h:87: warning: 'event_reset_time' initialized and declared 'extern'
event.h:87: error: variable or field 'event_reset_time' declared void
event.h:87: error: 'LPEVENT' was not declared in this scope
event.h:87: error: expected primary-expression before 'long'
event.h:91: warning: 'event_info' initialized and declared 'extern'
event.h:91: error: 'LPEVENT' was not declared in this scope
In file included from BattleArena.cpp:3:
BattleArena.h:21: error: 'LPEVENT' does not name a type
In file included from char.h:9,
from BattleArena.cpp:6:
horse_rider.h:88: error: 'LPEVENT' does not name a type
horse_rider.h:89: error: 'LPEVENT' does not name a type
horse_rider.h:91: error: 'LPEVENT' has not been declared
horse_rider.h:92: error: 'LPEVENT' has not been declared
In file included from char.h:15,
from BattleArena.cpp:6:
mining.h:6: error: 'LPEVENT' does not name a type
In file included from BattleArena.cpp:6:
char.h:461: error: 'boost' has not been declared
char.h:461: error: ISO C++ forbids declaration of 'unordered_map' with no type
char.h:461: error: expected ';' before '<' token
char.h:970: error: 'LPEVENT' has not been declared
char.h:1018: error: 'LPEVENT' does not name a type
char.h:1027: error: 'LPEVENT' was not declared in this scope
char.h:1027: error: template argument 2 is invalid
char.h:1027: error: template argument 4 is invalid
char.h:1437: error: 'LPEVENT' does not name a type
char.h:1466: error: 'boost' has not been declared
char.h:1466: error: ISO C++ forbids declaration of 'unordered_map' with no type
char.h:1466: error: expected ';' before '<' token
char.h:1717: error: 'LPEVENT' does not name a type
char.h:1718: error: 'LPEVENT' does not name a type
char.h:1719: error: 'LPEVENT' does not name a type
char.h:1720: error: 'LPEVENT' does not name a type
char.h:1721: error: 'LPEVENT' does not name a type
char.h:1722: error: 'LPEVENT' does not name a type
char.h:1723: error: 'LPEVENT' does not name a type
char.h:1724: error: 'LPEVENT' does not name a type
char.h:1725: error: 'LPEVENT' does not name a type
char.h:1726: error: 'LPEVENT' does not name a type
char.h:1731: error: 'LPEVENT' does not name a type
char.h:1733: error: 'LPEVENT' does not name a type
char.h:1734: error: 'LPEVENT' does not name a type
char.h:1735: error: 'LPEVENT' does not name a type
char.h:1736: error: 'LPEVENT' does not name a type
char.h:1745: error: 'LPEVENT' was not declared in this scope
char.h:1745: error: template argument 2 is invalid
char.h:1745: error: template argument 4 is invalid
char.h:1968: error: 'LPEVENT' does not name a type
char.h: In member function 'void CHARACTER::SetPartyRequestEvent(int)':
char.h:970: error: 'm_pkPartyRequestEvent' was not declared in this scope
char.h: In member function 'bool CHARACTER::IsWarping() const':
char.h:1738: error: 'm_pkWarpEvent' was not declared in this scope
In file included from sectree_manager.h:4,
from BattleArena.cpp:7:
sectree.h: At global scope:
sectree.h:166: error: 'LPEVENT' has not been declared
In file included from regen.h:1,
from BattleArena.cpp:8:
dungeon.h:154: error: 'LPEVENT' does not name a type
dungeon.h:156: error: 'LPEVENT' does not name a type
dungeon.h:157: error: 'LPEVENT' does not name a type
dungeon.h:161: error: 'LPEVENT' has not been declared
dungeon.h:163: error: 'LPEVENT' has not been declared
dungeon.h:164: error: 'LPEVENT' has not been declared
In file included from BattleArena.cpp:8:
regen.h:31: error: 'LPEVENT' does not name a type
regen.h: In constructor 'regen::regen()':
regen.h:47: error: type 'event' is not a direct base of 'regen'
In file included from questnpc.h:4,
from questmanager.h:6,
from BattleArena.cpp:9:
questpc.h: At global scope:
questpc.h:107: error: 'LPEVENT' has not been declared
questpc.h:175: error: 'LPEVENT' was not declared in this scope
questpc.h:175: error: template argument 2 is invalid
questpc.h:175: error: template argument 4 is invalid
In file included from BattleArena.cpp:9:
questmanager.h:72: error: 'LPEVENT' has not been declared
questmanager.h:184: error: 'LPEVENT' was not declared in this scope
questmanager.h:184: error: template argument 2 is invalid
questmanager.h:184: error: template argument 4 is invalid
questmanager.h:238: error: 'boost' has not been declared
questmanager.h:238: error: ISO C++ forbids declaration of 'unordered_map' with no type
questmanager.h:238: error: typedef name may not be a nested-name-specifier
questmanager.h:238: error: expected ';' before '<' token
questmanager.h:239: error: 'boost' has not been declared
questmanager.h:239: error: ISO C++ forbids declaration of 'unordered_map' with no type
questmanager.h:239: error: typedef name may not be a nested-name-specifier
questmanager.h:239: error: expected ';' before '<' token
questmanager.h:241: error: 'THashMapQuestName' does not name a type
questmanager.h:242: error: 'THashMapQuestStartScript' does not name a type
BattleArena.cpp: In constructor 'CBattleArena::CBattleArena()':
BattleArena.cpp:15: error: class 'CBattleArena' does not have any field named 'm_pEvent'
BattleArena.cpp: At global scope:
BattleArena.cpp:89: error: 'LPEVENT' was not declared in this scope
BattleArena.cpp:89: error: expected primary-expression before 'long'
BattleArena.cpp:89: error: initializer expression list treated as compound expression
BattleArena.cpp:90: error: expected ',' or ';' before '{' token
[Ares2 - OK] Compilare: MarkImage.cpp
gmake: *** [Makefile:132: OBJDIR/BattleArena.o] Error 1
gmake: *** Waiting for unfinished jobs....
In file included from stdafx.h:39,
from MarkConvert.cpp:1:
event.h:10:35: error: boost/intrusive_ptr.hpp: No such file or directory
In file included from stdafx.h:39,
from MarkImage.cpp:1:
event.h:10:35: error: boost/intrusive_ptr.hpp: No such file or directory
In file included from stdafx.h:39,
from MarkConvert.cpp:1:
event.h:37: error: 'boost' has not been declared
event.h:37: error: expected initializer before '<' token
event.h:38: error: typedef 'TEVENTFUNC' is initialized (use __typeof__ instead)
event.h:38: error: 'LPEVENT' was not declared in this scope
event.h:38: error: expected primary-expression before 'long'
event.h:57: error: 'TEVENTFUNC' does not name a type
event.h: In constructor 'event::event()':
event.h:47: error: class 'event' does not have any field named 'func'
event.h: At global scope:
event.h:83: error: 'LPEVENT' does not name a type
event.h:84: warning: 'event_cancel' initialized and declared 'extern'
event.h:84: error: variable or field 'event_cancel' declared void
event.h:84: error: 'LPEVENT' was not declared in this scope
event.h:84: error: expected primary-expression before ')' token
event.h:85: warning: 'event_processing_time' initialized and declared 'extern'
event.h:85: error: 'LPEVENT' was not declared in this scope
event.h:86: warning: 'event_time' initialized and declared 'extern'
event.h:86: error: 'LPEVENT' was not declared in this scope
event.h:87: warning: 'event_reset_time' initialized and declared 'extern'
event.h:87: error: variable or field 'event_reset_time' declared void
event.h:87: error: 'LPEVENT' was not declared in this scope
event.h:87: error: expected primary-expression before 'long'
event.h:91: warning: 'event_info' initialized and declared 'extern'
event.h:91: error: 'LPEVENT' was not declared in this scope
gmake: *** [Makefile:132: OBJDIR/MarkConvert.o] Error 1
In file included from stdafx.h:39,
from MarkImage.cpp:1:
event.h:37: error: 'boost' has not been declared
event.h:37: error: expected initializer before '<' token
event.h:38: error: typedef 'TEVENTFUNC' is initialized (use __typeof__ instead)
event.h:38: error: 'LPEVENT' was not declared in this scope
event.h:38: error: expected primary-expression before 'long'
event.h:57: error: 'TEVENTFUNC' does not name a type
event.h: In constructor 'event::event()':
event.h:47: error: class 'event' does not have any field named 'func'
event.h: At global scope:
event.h:83: error: 'LPEVENT' does not name a type
event.h:84: warning: 'event_cancel' initialized and declared 'extern'
event.h:84: error: variable or field 'event_cancel' declared void
event.h:84: error: 'LPEVENT' was not declared in this scope
event.h:84: error: expected primary-expression before ')' token
event.h:85: warning: 'event_processing_time' initialized and declared 'extern'
event.h:85: error: 'LPEVENT' was not declared in this scope
event.h:86: warning: 'event_time' initialized and declared 'extern'
event.h:86: error: 'LPEVENT' was not declared in this scope
event.h:87: warning: 'event_reset_time' initialized and declared 'extern'
event.h:87: error: variable or field 'event_reset_time' declared void
event.h:87: error: 'LPEVENT' was not declared in this scope
event.h:87: error: expected primary-expression before 'long'
event.h:91: warning: 'event_info' initialized and declared 'extern'
event.h:91: error: 'LPEVENT' was not declared in this scope
gmake: *** [Makefile:132: OBJDIR/MarkImage.o] Error 1






daca te-am ajutat