*Problemă: Erroare compilare game, nu primesc errori de compilare pe parcurs, dar primesc in final. A mai intalnit cineva asta?
Tipologie server: -
*Resursă folosită: GCC49
*ServerFiles utilizat: -
*Syserr: -
Poză: -
*Detalii suplimentare: Aceasta este erroarea
linking ../game_r41022
/usr/local/bin/ld: /usr/local/lib/mysql/libmysqlclient.a(my_aes_openssl.cc.o): undefined reference to symbol 'EVP_aes_128_cfb1'
//usr/local/lib/libcrypto.so.9: error adding symbols: DSO missing from command line
collect2: error: ld returned 1 exit status
gmake: *** [Makefile:203: ../game_r41022] Error 1
Erroare compilare game
Răspunsuri
1 Vizualizări
373
1 Vizualizări
373
-
- Informaţie
-
Cine este conectat
Utilizatori ce ce navighează pe acest forum: Niciun utilizator înregistrat și 122 vizitatori


