Salut după ce s-a compilat sursa db mi-a apărut erroarea asta.
/usr/bin/ld: cannot find -lgame
gmake: *** [Makefile:53: ../db_r40250] Error 1
gmake: *** [Makefile:140: ../game_r40250_32] Error 1
gmake: *** Waiting for unfinished jobs....
gmake: *** [Makefile:144: ../test] Error 1
Erroare compilare
cineva?
Cineva??
Up
[ Postat de pe Samsung Galaxy Note 3 ]
[ Postat de pe Samsung Galaxy Note 3 ]

-
- Informaţie
-
Cine este conectat
Utilizatori ce ce navighează pe acest forum: Baidu [Spider] și 153 vizitatori



daca te-am ajutat