Problema implementare mob target system

Totalitatea subiectelor care nu respectă regulamentul impus in sectiunea "Probleme şi Întrebări" vor fi stocate aici.
Închis
Avatar utilizator
RID8Rgaming
Nivel 3

Nivel 3
Mesaje: 316
Membru din: 01 Feb 2016, 05:08
Regat: Jinno
Aprecieri: 128  
Mulţumiri: 2  
 Contact:
Medalii

Vreau sa implementez Mob Target System si nu reusesc la partea din sursa/server. http://just4metin.ro/sursa/mob-target-s ... 54126.html
Folosesc [ServerFille]BEST PRODUCTION 1.8. Cand apas pe ? ma scoate de pe cont.
Am mai luat o varianta sa gasesc fisierele facute in sursa dar nu le gasesc: http://just4metin.ro/serverfiles/best-p ... 60642.html
[BEST Pro Game] Derleniyor: char_quickslot.cpp
In file included from arena.cpp:4:
packet.h:1581: error: duplicate 'typedef'
packet.h:1581: error: two or more data types in declaration of 'TPacketGCTargetInfo'
packet.h:1589: error: expected unqualified-id before '{' token
packet.h:1597: error: expected constructor, destructor, or type conversion before ';' token
In file included from packet_info.h:4,
from input.h:4,
from desc.h:5,
from battle.cpp:4:
packet.h:1581: error: duplicate 'typedef'
packet.h:1581: error: two or more data types in declaration of 'TPacketGCTargetInfo'
packet.h:1589: error: expected unqualified-id before '{' token
packet.h:1597: error: expected constructor, destructor, or type conversion before ';' token
In file included from packet_info.h:4,
from input.h:4,
from desc.h:5,
from char_battle.cpp:4:
packet.h:1581: error: duplicate 'typedef'
packet.h:1581: error: two or more data types in declaration of 'TPacketGCTargetInfo'
packet.h:1589: error: expected unqualified-id before '{' token
packet.h:1597: error: expected constructor, destructor, or type conversion before ';' token
[BEST Pro Game] Derleniyor: char_resist.cpp
[BEST Pro Game] Derleniyor: char_skill.cpp
[BEST Pro Game] Derleniyor: char_state.cpp
In file included from OXEvent.cpp:6:
packet.h:1581: error: duplicate 'typedef'
packet.h:1581: error: two or more data types in declaration of 'TPacketGCTargetInfo'
packet.h:1589: error: expected unqualified-id before '{' token
packet.h:1597: error: expected constructor, destructor, or type conversion before ';' token
[BEST Pro Game] Derleniyor: PetSystem.cpp
gmake: *** [OBJDIR/OXEvent.o] Error 1
gmake: *** Waiting for unfinished jobs....
In file included from packet_info.h:4,
from input.h:4,
from desc.h:5,
from char_item.cpp:10:
packet.h:1581: error: duplicate 'typedef'
packet.h:1581: error: two or more data types in declaration of 'TPacketGCTargetInfo'
packet.h:1589: error: expected unqualified-id before '{' token
packet.h:1597: error: expected constructor, destructor, or type conversion before ';' token
In file included from packet_info.h:4,
from input.h:4,
from desc.h:5,
from char_skill.cpp:10:
packet.h:1581: error: duplicate 'typedef'
packet.h:1581: error: two or more data types in declaration of 'TPacketGCTargetInfo'
packet.h:1589: error: expected unqualified-id before '{' token
packet.h:1597: error: expected constructor, destructor, or type conversion before ';' token
In file included from packet_info.h:4,
from input.h:4,
from desc.h:5,
from char_quickslot.cpp:4:
packet.h:1581: error: duplicate 'typedef'
packet.h:1581: error: two or more data types in declaration of 'TPacketGCTargetInfo'
packet.h:1589: error: expected unqualified-id before '{' token
packet.h:1597: error: expected constructor, destructor, or type conversion before ';' token
In file included from packet_info.h:4,
from input.h:4,
from desc.h:5,
from char_manager.cpp:4:
packet.h:1581: error: duplicate 'typedef'
packet.h:1581: error: two or more data types in declaration of 'TPacketGCTargetInfo'
packet.h:1589: error: expected unqualified-id before '{' token
packet.h:1597: error: expected constructor, destructor, or type conversion before ';' token
In file included from building.cpp:7:
packet.h:1581: error: duplicate 'typedef'
packet.h:1581: error: two or more data types in declaration of 'TPacketGCTargetInfo'
packet.h:1589: error: expected unqualified-id before '{' token
packet.h:1597: error: expected constructor, destructor, or type conversion before ';' token
In file included from char_affect.cpp:8:
packet.h:1581: error: duplicate 'typedef'
packet.h:1581: error: two or more data types in declaration of 'TPacketGCTargetInfo'
packet.h:1589: error: expected unqualified-id before '{' token
packet.h:1597: error: expected constructor, destructor, or type conversion before ';' token
In file included from packet_info.h:4,
from input.h:4,
from desc.h:5,
from desc_client.h:4,
from char.cpp:9:
packet.h:1581: error: duplicate 'typedef'
packet.h:1581: error: two or more data types in declaration of 'TPacketGCTargetInfo'
packet.h:1589: error: expected unqualified-id before '{' token
packet.h:1597: error: expected constructor, destructor, or type conversion before ';' token
In file included from char_horse.cpp:5:
packet.h:1581: error: duplicate 'typedef'
packet.h:1581: error: two or more data types in declaration of 'TPacketGCTargetInfo'
packet.h:1589: error: expected unqualified-id before '{' token
packet.h:1597: error: expected constructor, destructor, or type conversion before ';' token
gmake: *** [OBJDIR/arena.o] Error 1
gmake: *** [OBJDIR/char_skill.o] Error 1
In file included from char_state.cpp:8:
packet.h:1581: error: duplicate 'typedef'
packet.h:1581: error: two or more data types in declaration of 'TPacketGCTargetInfo'
packet.h:1589: error: expected unqualified-id before '{' token
packet.h:1597: error: expected constructor, destructor, or type conversion before ';' token
In file included from PetSystem.cpp:10:
packet.h:1581: error: duplicate 'typedef'
packet.h:1581: error: two or more data types in declaration of 'TPacketGCTargetInfo'
packet.h:1589: error: expected unqualified-id before '{' token
packet.h:1597: error: expected constructor, destructor, or type conversion before ';' token
gmake: *** [OBJDIR/PetSystem.o] Error 1
gmake: *** [OBJDIR/char_state.o] Error 1
gmake: *** [OBJDIR/char_manager.o] Error 1
gmake: *** [OBJDIR/char_horse.o] Error 1
gmake: *** [OBJDIR/char_quickslot.o] Error 1
gmake: *** [OBJDIR/char_affect.o] Error 1
char.cpp: In member function 'void CHARACTER::ClearTarget()':
char.cpp:5680: error: 'TPacketGCTarget' was not declared in this scope
char.cpp:5680: error: expected `;' before 'p'
char.cpp:5682: error: 'p' was not declared in this scope
char.cpp: In member function 'void CHARACTER::SetTarget(CHARACTER*)':
char.cpp:5721: error: 'TPacketGCTarget' was not declared in this scope
char.cpp:5721: error: expected `;' before 'p'
char.cpp:5722: error: 'p' was not declared in this scope
char.cpp: In member function 'void CHARACTER::BroadcastTargetPacket()':
char.cpp:5827: error: 'TPacketGCTarget' was not declared in this scope
char.cpp:5827: error: expected `;' before 'p'
char.cpp:5828: error: 'p' was not declared in this scope
gmake: *** [OBJDIR/battle.o] Error 1
gmake: *** [OBJDIR/building.o] Error 1
gmake: *** [OBJDIR/char_battle.o] Error 1
gmake: *** [OBJDIR/char.o] Error 1
gmake: *** [OBJDIR/char_item.o] Error 1
root@:/usr/sursa/Server/game/src # In file included from arena.cpp:4:
In: Command not found.
root@:/usr/sursa/Server/game/src # packet.h:1581: error: duplicate 'typedef'
packet.h:1581:: Too many arguments.
root@:/usr/sursa/Server/game/src # packet.h:1581: error: two or more data types in declaration of 'TPacketGCTargetInfo'
packet.h:1581:: Too many arguments.
root@:/usr/sursa/Server/game/src # packet.h:1589: error: expected unqualified-id before '{' token
packet.h:1589:: Too many arguments.
root@:/usr/sursa/Server/game/src # packet.h:1597: error: expected constructor, destructor, or type conversion before ';' token
packet.h:1597:: Too many arguments.
root@:/usr/sursa/Server/game/src # In file included from packet_info.h:4,
In: Command not found.
root@:/usr/sursa/Server/game/src # from input.h:4,
from: can't read /var/mail/input.h:4,
root@:/usr/sursa/Server/game/src # from desc.h:5,
from: can't read /var/mail/desc.h:5,
root@:/usr/sursa/Server/game/src # from battle.cpp:4:
from: can't read /var/mail/battle.cpp:4:
root@:/usr/sursa/Server/game/src # packet.h:1581: error: duplicate 'typedef'
packet.h:1581:: Too many arguments.
root@:/usr/sursa/Server/game/src # packet.h:1581: error: two or more data types in declaration of 'TPacketGCTargetInfo'
packet.h:1581:: Too many arguments.
root@:/usr/sursa/Server/game/src # packet.h:1589: error: expected unqualified-id before '{' token
packet.h:1589:: Too many arguments.
root@:/usr/sursa/Server/game/src # packet.h:1597: error: expected constructor, destructor, or type conversion before ';' token
packet.h:1597:: Too many arguments.
root@:/usr/sursa/Server/game/src # In file included from packet_info.h:4,
In: Command not found.
root@:/usr/sursa/Server/game/src # from input.h:4,
from: can't read /var/mail/input.h:4,
root@:/usr/sursa/Server/game/src # from desc.h:5,
from: can't read /var/mail/desc.h:5,
root@:/usr/sursa/Server/game/src # from char_battle.cpp:4:
from: can't read /var/mail/char_battle.cpp:4:
root@:/usr/sursa/Server/game/src # packet.h:1581: error: duplicate 'typedef'
packet.h:1581:: Too many arguments.
root@:/usr/sursa/Server/game/src # packet.h:1581: error: two or more data types in declaration of 'TPacketGCTargetInfo'
packet.h:1581:: Too many arguments.
root@:/usr/sursa/Server/game/src # packet.h:1589: error: expected unqualified-id before '{' token
packet.h:1589:: Too many arguments.
root@:/usr/sursa/Server/game/src # packet.h:1597: error: expected constructor, destructor, or type conversion before ';' token
packet.h:1597:: Too many arguments.
root@:/usr/sursa/Server/game/src # [BEST Pro Game] Derleniyor: char_resist.cpp
[BEST: Command not found.
root@:/usr/sursa/Server/game/src # [BEST Pro Game] Derleniyor: char_skill.cpp
[BEST: Command not found.
root@:/usr/sursa/Server/game/src # [BEST Pro Game] Derleniyor: char_state.cpp
[BEST: Command not found.
root@:/usr/sursa/Server/game/src # In file included from OXEvent.cpp:6:
In: Command not found.
root@:/usr/sursa/Server/game/src # packet.h:1581: error: duplicate 'typedef'
packet.h:1581:: Too many arguments.
root@:/usr/sursa/Server/game/src # packet.h:1581: error: two or more data types in declaration of 'TPacketGCTargetInfo'
packet.h:1581:: Too many arguments.
root@:/usr/sursa/Server/game/src # packet.h:1589: error: expected unqualified-id before '{' token
packet.h:1589:: Too many arguments.
root@:/usr/sursa/Server/game/src # packet.h:1597: error: expected constructor, destructor, or type conversion before ';' token
packet.h:1597:: Too many arguments.
root@:/usr/sursa/Server/game/src # [BEST Pro Game] Derleniyor: PetSystem.cpp
[BEST: Command not found.
root@:/usr/sursa/Server/game/src # gmake: *** [OBJDIR/OXEvent.o] Error 1
gmake:: Too many arguments.
root@:/usr/sursa/Server/game/src # gmake: *** Waiting for unfinished jobs....
gmake:: Too many arguments.
root@:/usr/sursa/Server/game/src # In file included from packet_info.h:4,
In: Command not found.
root@:/usr/sursa/Server/game/src # from input.h:4,
from: can't read /var/mail/input.h:4,
root@:/usr/sursa/Server/game/src # from desc.h:5,
from: can't read /var/mail/desc.h:5,
root@:/usr/sursa/Server/game/src # from char_item.cpp:10:
from: can't read /var/mail/char_item.cpp:10:
root@:/usr/sursa/Server/game/src # packet.h:1581: error: duplicate 'typedef'
packet.h:1581:: Too many arguments.
root@:/usr/sursa/Server/game/src # packet.h:1581: error: two or more data types in declaration of 'TPacketGCTargetInfo'
packet.h:1581:: Too many arguments.
root@:/usr/sursa/Server/game/src # packet.h:1589: error: expected unqualified-id before '{' token
packet.h:1589:: Too many arguments.
root@:/usr/sursa/Server/game/src # packet.h:1597: error: expected constructor, destructor, or type conversion before ';' token
packet.h:1597:: Too many arguments.
root@:/usr/sursa/Server/game/src # In file included from packet_info.h:4,
In: Command not found.
root@:/usr/sursa/Server/game/src # from input.h:4,
from: can't read /var/mail/input.h:4,
root@:/usr/sursa/Server/game/src # from desc.h:5,
from: can't read /var/mail/desc.h:5,
root@:/usr/sursa/Server/game/src # from char_skill.cpp:10:
from: can't read /var/mail/char_skill.cpp:10:
root@:/usr/sursa/Server/game/src # packet.h:1581: error: duplicate 'typedef'
packet.h:1581:: Too many arguments.
root@:/usr/sursa/Server/game/src # packet.h:1581: error: two or more data types in declaration of 'TPacketGCTargetInfo'
packet.h:1581:: Too many arguments.
root@:/usr/sursa/Server/game/src # packet.h:1589: error: expected unqualified-id before '{' token
packet.h:1589:: Too many arguments.
root@:/usr/sursa/Server/game/src # packet.h:1597: error: expected constructor, destructor, or type conversion before ';' token
packet.h:1597:: Too many arguments.
root@:/usr/sursa/Server/game/src # In file included from packet_info.h:4,
In: Command not found.
root@:/usr/sursa/Server/game/src # from input.h:4,
from: can't read /var/mail/input.h:4,
root@:/usr/sursa/Server/game/src # from desc.h:5,
from: can't read /var/mail/desc.h:5,
root@:/usr/sursa/Server/game/src # from char_quickslot.cpp:4:
from: can't read /var/mail/char_quickslot.cpp:4:
root@:/usr/sursa/Server/game/src # packet.h:1581: error: duplicate 'typedef'
packet.h:1581:: Too many arguments.
root@:/usr/sursa/Server/game/src # packet.h:1581: error: two or more data types in declaration of 'TPacketGCTargetInfo'
packet.h:1581:: Too many arguments.
root@:/usr/sursa/Server/game/src # packet.h:1589: error: expected unqualified-id before '{' token
packet.h:1589:: Too many arguments.
root@:/usr/sursa/Server/game/src # packet.h:1597: error: expected constructor, destructor, or type conversion before ';' token
packet.h:1597:: Too many arguments.
root@:/usr/sursa/Server/game/src # In file included from packet_info.h:4,
In: Command not found.
root@:/usr/sursa/Server/game/src # from input.h:4,
from: can't read /var/mail/input.h:4,
root@:/usr/sursa/Server/game/src # from desc.h:5,
from: can't read /var/mail/desc.h:5,
root@:/usr/sursa/Server/game/src # from char_manager.cpp:4:
from: can't read /var/mail/char_manager.cpp:4:
root@:/usr/sursa/Server/game/src # packet.h:1581: error: duplicate 'typedef'
packet.h:1581:: Too many arguments.
root@:/usr/sursa/Server/game/src # packet.h:1581: error: two or more data types in declaration of 'TPacketGCTargetInfo'
packet.h:1581:: Too many arguments.
root@:/usr/sursa/Server/game/src # packet.h:1589: error: expected unqualified-id before '{' token
packet.h:1589:: Too many arguments.
root@:/usr/sursa/Server/game/src # packet.h:1597: error: expected constructor, destructor, or type conversion before ';' token
packet.h:1597:: Too many arguments.
root@:/usr/sursa/Server/game/src # In file included from building.cpp:7:
In: Command not found.
root@:/usr/sursa/Server/game/src # packet.h:1581: error: duplicate 'typedef'
packet.h:1581:: Too many arguments.
root@:/usr/sursa/Server/game/src # packet.h:1581: error: two or more data types in declaration of 'TPacketGCTargetInfo'
packet.h:1581:: Too many arguments.
root@:/usr/sursa/Server/game/src # packet.h:1589: error: expected unqualified-id before '{' token
packet.h:1589:: Too many arguments.
root@:/usr/sursa/Server/game/src # packet.h:1597: error: expected constructor, destructor, or type conversion before ';' token
packet.h:1597:: Too many arguments.
root@:/usr/sursa/Server/game/src # In file included from char_affect.cpp:8:
In: Command not found.
root@:/usr/sursa/Server/game/src # packet.h:1581: error: duplicate 'typedef'
packet.h:1581:: Too many arguments.
root@:/usr/sursa/Server/game/src # packet.h:1581: error: two or more data types in declaration of 'TPacketGCTargetInfo'
packet.h:1581:: Too many arguments.
root@:/usr/sursa/Server/game/src # packet.h:1589: error: expected unqualified-id before '{' token
packet.h:1589:: Too many arguments.
root@:/usr/sursa/Server/game/src # packet.h:1597: error: expected constructor, destructor, or type conversion before ';' token
packet.h:1597:: Too many arguments.
root@:/usr/sursa/Server/game/src # In file included from packet_info.h:4,
In: Command not found.
root@:/usr/sursa/Server/game/src # from input.h:4,
from: can't read /var/mail/input.h:4,
root@:/usr/sursa/Server/game/src # from desc.h:5,
from: can't read /var/mail/desc.h:5,
root@:/usr/sursa/Server/game/src # from desc_client.h:4,
from: can't read /var/mail/desc_client.h:4,
root@:/usr/sursa/Server/game/src # from char.cpp:9:
from: can't read /var/mail/char.cpp:9:
root@:/usr/sursa/Server/game/src # packet.h:1581: error: duplicate 'typedef'
packet.h:1581:: Too many arguments.
root@:/usr/sursa/Server/game/src # packet.h:1581: error: two or more data types in declaration of 'TPacketGCTargetInfo'
packet.h:1581:: Too many arguments.
root@:/usr/sursa/Server/game/src # packet.h:1589: error: expected unqualified-id before '{' token
packet.h:1589:: Too many arguments.
root@:/usr/sursa/Server/game/src # packet.h:1597: error: expected constructor, destructor, or type conversion before ';' token
packet.h:1597:: Too many arguments.
root@:/usr/sursa/Server/game/src # In file included from char_horse.cpp:5:
In: Command not found.
root@:/usr/sursa/Server/game/src # packet.h:1581: error: duplicate 'typedef'
packet.h:1581:: Too many arguments.
root@:/usr/sursa/Server/game/src # packet.h:1581: error: two or more data types in declaration of 'TPacketGCTargetInfo'
packet.h:1581:: Too many arguments.
root@:/usr/sursa/Server/game/src # packet.h:1589: error: expected unqualified-id before '{' token
packet.h:1589:: Too many arguments.
root@:/usr/sursa/Server/game/src # packet.h:1597: error: expected constructor, destructor, or type conversion before ';' token
packet.h:1597:: Too many arguments.
root@:/usr/sursa/Server/game/src # gmake: *** [OBJDIR/arena.o] Error 1
gmake:: Too many arguments.
root@:/usr/sursa/Server/game/src # gmake: *** [OBJDIR/char_skill.o] Error 1
gmake:: Too many arguments.
root@:/usr/sursa/Server/game/src # In file included from char_state.cpp:8:
In: Command not found.
root@:/usr/sursa/Server/game/src # packet.h:1581: error: duplicate 'typedef'
packet.h:1581:: Too many arguments.
root@:/usr/sursa/Server/game/src # packet.h:1581: error: two or more data types in declaration of 'TPacketGCTargetInfo'
packet.h:1581:: Too many arguments.
root@:/usr/sursa/Server/game/src # packet.h:1589: error: expected unqualified-id before '{' token
packet.h:1589:: Too many arguments.
root@:/usr/sursa/Server/game/src # packet.h:1597: error: expected constructor, destructor, or type conversion before ';' token
packet.h:1597:: Too many arguments.
root@:/usr/sursa/Server/game/src # In file included from PetSystem.cpp:10:
In: Command not found.
root@:/usr/sursa/Server/game/src # packet.h:1581: error: duplicate 'typedef'
packet.h:1581:: Too many arguments.
root@:/usr/sursa/Server/game/src # packet.h:1581: error: two or more data types in declaration of 'TPacketGCTargetInfo'
packet.h:1581:: Too many arguments.
root@:/usr/sursa/Server/game/src # packet.h:1589: error: expected unqualified-id before '{' token
packet.h:1589:: Too many arguments.
root@:/usr/sursa/Server/game/src # packet.h:1597: error: expected constructor, destructor, or type conversion before ';' token
packet.h:1597:: Too many arguments.
root@:/usr/sursa/Server/game/src # gmake: *** [OBJDIR/PetSystem.o] Error 1
gmake:: Too many arguments.
root@:/usr/sursa/Server/game/src # gmake: *** [OBJDIR/char_state.o] Error 1
gmake:: Too many arguments.
root@:/usr/sursa/Server/game/src # gmake: *** [OBJDIR/char_manager.o] Error 1
gmake:: Too many arguments.
root@:/usr/sursa/Server/game/src # gmake: *** [OBJDIR/char_horse.o] Error 1
gmake:: Too many arguments.
root@:/usr/sursa/Server/game/src # gmake: *** [OBJDIR/char_quickslot.o] Error 1
gmake:: Too many arguments.
root@:/usr/sursa/Server/game/src # gmake: *** [OBJDIR/char_affect.o] Error 1
gmake:: Too many arguments.
root@:/usr/sursa/Server/game/src # char.cpp: In member function 'void CHARACTER::ClearTarget()':
char.cpp:: Too many arguments.
root@:/usr/sursa/Server/game/src # char.cpp:5680: error: 'TPacketGCTarget' was not declared in this scope
char.cpp:5680:: Too many arguments.
root@:/usr/sursa/Server/game/src # char.cpp:5680: error: expected `;' before 'p'
Unmatched `.
root@:/usr/sursa/Server/game/src # char.cpp:5682: error: 'p' was not declared in this scope
char.cpp:5682:: Too many arguments.
root@:/usr/sursa/Server/game/src # char.cpp: In member function 'void CHARACTER::SetTarget(CHARACTER*)':
char.cpp:: Too many arguments.
root@:/usr/sursa/Server/game/src # char.cpp:5721: error: 'TPacketGCTarget' was not declared in this scope
char.cpp:5721:: Too many arguments.
root@:/usr/sursa/Server/game/src # char.cpp:5721: error: expected `;' before 'p'
Unmatched `.
root@:/usr/sursa/Server/game/src # char.cpp:5722: error: 'p' was not declared in this scope
char.cpp:5722:: Too many arguments.
root@:/usr/sursa/Server/game/src # char.cpp: In member function 'void CHARACTER::BroadcastTargetPacket()':
char.cpp:: Too many arguments.
root@:/usr/sursa/Server/game/src # char.cpp:5827: error: 'TPacketGCTarget' was not declared in this scope
char.cpp:5827:: Too many arguments.
root@:/usr/sursa/Server/game/src # char.cpp:5827: error: expected `;' before 'p'
Unmatched `.
root@:/usr/sursa/Server/game/src # char.cpp:5828: error: 'p' was not declared in this scope
char.cpp:5828:: Too many arguments.
root@:/usr/sursa/Server/game/src # gmake: *** [OBJDIR/battle.o] Error 1
gmake:: Too many arguments.
root@:/usr/sursa/Server/game/src # gmake: *** [OBJDIR/building.o] Error 1
gmake:: Too many arguments.
root@:/usr/sursa/Server/game/src # gmake: *** [OBJDIR/char_battle.o] Error 1
gmake:: Too many arguments.
root@:/usr/sursa/Server/game/src # gmake: *** [OBJDIR/char.o] Error 1
gmake:: Too many arguments.
root@:/usr/sursa/Server/game/src # gmake: *** [OBJDIR/char_item.o] Error 1
gmake:: Too many arguments.
Imagine
Afișează semnătura
Avatar utilizator
ZNF
Membru Club

Membru Club
Mesaje: 1953
Membru din: 16 Feb 2014, 10:09
Aprecieri: 15  
Mulţumiri: 110  
Discord: Copiază ID
Medalii

Ai gresit total, daca ai facut backup compara fisierele cu astea http://just4metin.ro/serverfiles/server ... 59321.html si fii foarte atent.
Avatar utilizator
RID8Rgaming
Nivel 3

Nivel 3
Mesaje: 316
Membru din: 01 Feb 2016, 05:08
Regat: Jinno
Aprecieri: 128  
Mulţumiri: 2  
 Contact:
Medalii

Alin Ionuț scrie:Ai gresit total, daca ai facut backup compara fisierele cu astea http://just4metin.ro/serverfiles/server ... 59321.html si fii foarte atent.
Normal ca am backup. Am sa refac fisierele si dupa le compar. Multumesc pentru staf, am sa revin cu edit.
Imagine
Afișează semnătura
Avatar utilizator
RID8Rgaming
Nivel 3

Nivel 3
Mesaje: 316
Membru din: 01 Feb 2016, 05:08
Regat: Jinno
Aprecieri: 128  
Mulţumiri: 2  
 Contact:
Medalii

Alin Ionuț scrie:Ai gresit total, daca ai facut backup compara fisierele cu astea http://just4metin.ro/serverfiles/server ... 59321.html si fii foarte atent.
Am refacut si acum am alta problema:
char.cpp: In member function 'void CHARACTER::ClearTarget()':
char.cpp:5683: error: 'struct TPacketGCTarget' has no member named 'iMinHP'
char.cpp:5684: error: 'struct TPacketGCTarget' has no member named 'iMaxHP'
char.cpp: In member function 'void CHARACTER::SetTarget(CHARACTER*)':
char.cpp:5729: error: 'struct TPacketGCTarget' has no member named 'iMinHP'
char.cpp:5730: error: 'struct TPacketGCTarget' has no member named 'iMaxHP'
char.cpp:5737: error: 'struct TPacketGCTarget' has no member named 'iMinHP'
char.cpp:5738: error: 'struct TPacketGCTarget' has no member named 'iMaxHP'
char.cpp:5763: error: 'struct TPacketGCTarget' has no member named 'iMinHP'
char.cpp:5764: error: 'struct TPacketGCTarget' has no member named 'iMaxHP'
char.cpp:5771: error: 'struct TPacketGCTarget' has no member named 'iMinHP'
char.cpp:5772: error: 'struct TPacketGCTarget' has no member named 'iMaxHP'
char.cpp:5780: error: 'struct TPacketGCTarget' has no member named 'iMinHP'
char.cpp:5781: error: 'struct TPacketGCTarget' has no member named 'iMaxHP'
char.cpp:5791: error: 'struct TPacketGCTarget' has no member named 'iMinHP'
char.cpp:5792: error: 'struct TPacketGCTarget' has no member named 'iMaxHP'
char.cpp:5799: error: 'struct TPacketGCTarget' has no member named 'iMinHP'
char.cpp:5800: error: 'struct TPacketGCTarget' has no member named 'iMaxHP'
char.cpp:5811: error: 'struct TPacketGCTarget' has no member named 'iMinHP'
char.cpp:5812: error: 'struct TPacketGCTarget' has no member named 'iMaxHP'
char.cpp: In member function 'void CHARACTER::BroadcastTargetPacket()':
char.cpp:5831: error: 'struct TPacketGCTarget' has no member named 'iMinHP'
char.cpp:5832: error: 'struct TPacketGCTarget' has no member named 'iMaxHP'
char.cpp:5840: error: 'struct TPacketGCTarget' has no member named 'iMinHP'
char.cpp:5841: error: 'struct TPacketGCTarget' has no member named 'iMaxHP'
Nu stiu ce sistem este acela si cred ca el cauzeaza problema. In char.cpp am ceva asemanator:

Eu am vazut la descrierea originala ca sistemul era functional. Nu l-a pus tot si nu stiu cum sa-l repar.
Imagine
Afișează semnătura
Avatar utilizator
ZNF
Membru Club

Membru Club
Mesaje: 1953
Membru din: 16 Feb 2014, 10:09
Aprecieri: 15  
Mulţumiri: 110  
Discord: Copiază ID
Medalii

RID8Rgaming scrie:
Alin Ionuț scrie:Ai gresit total, daca ai facut backup compara fisierele cu astea http://just4metin.ro/serverfiles/server ... 59321.html si fii foarte atent.
Am refacut si acum am alta problema:
char.cpp: In member function 'void CHARACTER::ClearTarget()':
char.cpp:5683: error: 'struct TPacketGCTarget' has no member named 'iMinHP'
char.cpp:5684: error: 'struct TPacketGCTarget' has no member named 'iMaxHP'
char.cpp: In member function 'void CHARACTER::SetTarget(CHARACTER*)':
char.cpp:5729: error: 'struct TPacketGCTarget' has no member named 'iMinHP'
char.cpp:5730: error: 'struct TPacketGCTarget' has no member named 'iMaxHP'
char.cpp:5737: error: 'struct TPacketGCTarget' has no member named 'iMinHP'
char.cpp:5738: error: 'struct TPacketGCTarget' has no member named 'iMaxHP'
char.cpp:5763: error: 'struct TPacketGCTarget' has no member named 'iMinHP'
char.cpp:5764: error: 'struct TPacketGCTarget' has no member named 'iMaxHP'
char.cpp:5771: error: 'struct TPacketGCTarget' has no member named 'iMinHP'
char.cpp:5772: error: 'struct TPacketGCTarget' has no member named 'iMaxHP'
char.cpp:5780: error: 'struct TPacketGCTarget' has no member named 'iMinHP'
char.cpp:5781: error: 'struct TPacketGCTarget' has no member named 'iMaxHP'
char.cpp:5791: error: 'struct TPacketGCTarget' has no member named 'iMinHP'
char.cpp:5792: error: 'struct TPacketGCTarget' has no member named 'iMaxHP'
char.cpp:5799: error: 'struct TPacketGCTarget' has no member named 'iMinHP'
char.cpp:5800: error: 'struct TPacketGCTarget' has no member named 'iMaxHP'
char.cpp:5811: error: 'struct TPacketGCTarget' has no member named 'iMinHP'
char.cpp:5812: error: 'struct TPacketGCTarget' has no member named 'iMaxHP'
char.cpp: In member function 'void CHARACTER::BroadcastTargetPacket()':
char.cpp:5831: error: 'struct TPacketGCTarget' has no member named 'iMinHP'
char.cpp:5832: error: 'struct TPacketGCTarget' has no member named 'iMaxHP'
char.cpp:5840: error: 'struct TPacketGCTarget' has no member named 'iMinHP'
char.cpp:5841: error: 'struct TPacketGCTarget' has no member named 'iMaxHP'
Nu stiu ce sistem este acela si cred ca el cauzeaza problema. In char.cpp am ceva asemanator:

Eu am vazut la descrierea originala ca sistemul era functional. Nu l-a pus tot si nu stiu cum sa-l repar.
Lasa-mi fisierul original nemodificat char.cpp
Avatar utilizator
RID8Rgaming
Nivel 3

Nivel 3
Mesaje: 316
Membru din: 01 Feb 2016, 05:08
Regat: Jinno
Aprecieri: 128  
Mulţumiri: 2  
 Contact:
Medalii

Alin Ionuț scrie:
RID8Rgaming scrie:
Alin Ionuț scrie:Ai gresit total, daca ai facut backup compara fisierele cu astea http://just4metin.ro/serverfiles/server ... 59321.html si fii foarte atent.
Am refacut si acum am alta problema:
char.cpp: In member function 'void CHARACTER::ClearTarget()':
char.cpp:5683: error: 'struct TPacketGCTarget' has no member named 'iMinHP'
char.cpp:5684: error: 'struct TPacketGCTarget' has no member named 'iMaxHP'
char.cpp: In member function 'void CHARACTER::SetTarget(CHARACTER*)':
char.cpp:5729: error: 'struct TPacketGCTarget' has no member named 'iMinHP'
char.cpp:5730: error: 'struct TPacketGCTarget' has no member named 'iMaxHP'
char.cpp:5737: error: 'struct TPacketGCTarget' has no member named 'iMinHP'
char.cpp:5738: error: 'struct TPacketGCTarget' has no member named 'iMaxHP'
char.cpp:5763: error: 'struct TPacketGCTarget' has no member named 'iMinHP'
char.cpp:5764: error: 'struct TPacketGCTarget' has no member named 'iMaxHP'
char.cpp:5771: error: 'struct TPacketGCTarget' has no member named 'iMinHP'
char.cpp:5772: error: 'struct TPacketGCTarget' has no member named 'iMaxHP'
char.cpp:5780: error: 'struct TPacketGCTarget' has no member named 'iMinHP'
char.cpp:5781: error: 'struct TPacketGCTarget' has no member named 'iMaxHP'
char.cpp:5791: error: 'struct TPacketGCTarget' has no member named 'iMinHP'
char.cpp:5792: error: 'struct TPacketGCTarget' has no member named 'iMaxHP'
char.cpp:5799: error: 'struct TPacketGCTarget' has no member named 'iMinHP'
char.cpp:5800: error: 'struct TPacketGCTarget' has no member named 'iMaxHP'
char.cpp:5811: error: 'struct TPacketGCTarget' has no member named 'iMinHP'
char.cpp:5812: error: 'struct TPacketGCTarget' has no member named 'iMaxHP'
char.cpp: In member function 'void CHARACTER::BroadcastTargetPacket()':
char.cpp:5831: error: 'struct TPacketGCTarget' has no member named 'iMinHP'
char.cpp:5832: error: 'struct TPacketGCTarget' has no member named 'iMaxHP'
char.cpp:5840: error: 'struct TPacketGCTarget' has no member named 'iMinHP'
char.cpp:5841: error: 'struct TPacketGCTarget' has no member named 'iMaxHP'
Nu stiu ce sistem este acela si cred ca el cauzeaza problema. In char.cpp am ceva asemanator:

Eu am vazut la descrierea originala ca sistemul era functional. Nu l-a pus tot si nu stiu cum sa-l repar.
Lasa-mi fisierul original nemodificat char.cpp
Imagine
Afișează semnătura
Avatar utilizator
RID8Rgaming
Nivel 3

Nivel 3
Mesaje: 316
Membru din: 01 Feb 2016, 05:08
Regat: Jinno
Aprecieri: 128  
Mulţumiri: 2  
 Contact:
Medalii

up
Imagine
Afișează semnătura
Avatar utilizator
ZNF
Membru Club

Membru Club
Mesaje: 1953
Membru din: 16 Feb 2014, 10:09
Aprecieri: 15  
Mulţumiri: 110  
Discord: Copiază ID
Medalii

Subiect inactiv,arhivat!
Închis
Răspunsuri
6
Vizualizări
633
Răspunsuri
5
Vizualizări
355
Răspunsuri
5
Vizualizări
175
Răspunsuri
2
Vizualizări
225

Înapoi la “Arhivă Probleme şi Întrebări”

  • Informaţie
  • Cine este conectat

    Utilizatori ce ce navighează pe acest forum: Semrush [Bot] și 75 vizitatori