Folosesc [ServerFille]BEST PRODUCTION 1.8. Cand apas pe ? ma scoate de pe cont.
Am mai luat o varianta sa gasesc fisierele facute in sursa dar nu le gasesc: http://just4metin.ro/serverfiles/best-p ... 60642.html
[BEST Pro Game] Derleniyor: char_quickslot.cpp
In file included from arena.cpp:4:
packet.herror: duplicate 'typedef'
packet.herror: two or more data types in declaration of 'TPacketGCTargetInfo'
packet.herror: expected unqualified-id before '{' token
packet.herror: expected constructor, destructor, or type conversion before ';' token
In file included from packet_info.h:4,
from input.h:4,
from desc.h:5,
from battle.cpp:4:
packet.herror: duplicate 'typedef'
packet.herror: two or more data types in declaration of 'TPacketGCTargetInfo'
packet.herror: expected unqualified-id before '{' token
packet.herror: expected constructor, destructor, or type conversion before ';' token
In file included from packet_info.h:4,
from input.h:4,
from desc.h:5,
from char_battle.cpp:4:
packet.herror: duplicate 'typedef'
packet.herror: two or more data types in declaration of 'TPacketGCTargetInfo'
packet.herror: expected unqualified-id before '{' token
packet.herror: expected constructor, destructor, or type conversion before ';' token
[BEST Pro Game] Derleniyor: char_resist.cpp
[BEST Pro Game] Derleniyor: char_skill.cpp
[BEST Pro Game] Derleniyor: char_state.cpp
In file included from OXEvent.cpp:6:
packet.herror: duplicate 'typedef'
packet.herror: two or more data types in declaration of 'TPacketGCTargetInfo'
packet.herror: expected unqualified-id before '{' token
packet.herror: expected constructor, destructor, or type conversion before ';' token
[BEST Pro Game] Derleniyor: PetSystem.cpp
gmake: *** [OBJDIR/OXEvent.o] Error 1
gmake: *** Waiting for unfinished jobs....
In file included from packet_info.h:4,
from input.h:4,
from desc.h:5,
from char_item.cpp:10:
packet.herror: duplicate 'typedef'
packet.herror: two or more data types in declaration of 'TPacketGCTargetInfo'
packet.herror: expected unqualified-id before '{' token
packet.herror: expected constructor, destructor, or type conversion before ';' token
In file included from packet_info.h:4,
from input.h:4,
from desc.h:5,
from char_skill.cpp:10:
packet.herror: duplicate 'typedef'
packet.herror: two or more data types in declaration of 'TPacketGCTargetInfo'
packet.herror: expected unqualified-id before '{' token
packet.herror: expected constructor, destructor, or type conversion before ';' token
In file included from packet_info.h:4,
from input.h:4,
from desc.h:5,
from char_quickslot.cpp:4:
packet.herror: duplicate 'typedef'
packet.herror: two or more data types in declaration of 'TPacketGCTargetInfo'
packet.herror: expected unqualified-id before '{' token
packet.herror: expected constructor, destructor, or type conversion before ';' token
In file included from packet_info.h:4,
from input.h:4,
from desc.h:5,
from char_manager.cpp:4:
packet.herror: duplicate 'typedef'
packet.herror: two or more data types in declaration of 'TPacketGCTargetInfo'
packet.herror: expected unqualified-id before '{' token
packet.herror: expected constructor, destructor, or type conversion before ';' token
In file included from building.cpp:7:
packet.herror: duplicate 'typedef'
packet.herror: two or more data types in declaration of 'TPacketGCTargetInfo'
packet.herror: expected unqualified-id before '{' token
packet.herror: expected constructor, destructor, or type conversion before ';' token
In file included from char_affect.cpp:8:
packet.herror: duplicate 'typedef'
packet.herror: two or more data types in declaration of 'TPacketGCTargetInfo'
packet.herror: expected unqualified-id before '{' token
packet.herror: expected constructor, destructor, or type conversion before ';' token
In file included from packet_info.h:4,
from input.h:4,
from desc.h:5,
from desc_client.h:4,
from char.cpp:9:
packet.herror: duplicate 'typedef'
packet.herror: two or more data types in declaration of 'TPacketGCTargetInfo'
packet.herror: expected unqualified-id before '{' token
packet.herror: expected constructor, destructor, or type conversion before ';' token
In file included from char_horse.cpp:5:
packet.herror: duplicate 'typedef'
packet.herror: two or more data types in declaration of 'TPacketGCTargetInfo'
packet.herror: expected unqualified-id before '{' token
packet.herror: expected constructor, destructor, or type conversion before ';' token
gmake: *** [OBJDIR/arena.o] Error 1
gmake: *** [OBJDIR/char_skill.o] Error 1
In file included from char_state.cpp:8:
packet.herror: duplicate 'typedef'
packet.herror: two or more data types in declaration of 'TPacketGCTargetInfo'
packet.herror: expected unqualified-id before '{' token
packet.herror: expected constructor, destructor, or type conversion before ';' token
In file included from PetSystem.cpp:10:
packet.herror: duplicate 'typedef'
packet.herror: two or more data types in declaration of 'TPacketGCTargetInfo'
packet.herror: expected unqualified-id before '{' token
packet.herror: expected constructor, destructor, or type conversion before ';' token
gmake: *** [OBJDIR/PetSystem.o] Error 1
gmake: *** [OBJDIR/char_state.o] Error 1
gmake: *** [OBJDIR/char_manager.o] Error 1
gmake: *** [OBJDIR/char_horse.o] Error 1
gmake: *** [OBJDIR/char_quickslot.o] Error 1
gmake: *** [OBJDIR/char_affect.o] Error 1
char.cpp: In member function 'void CHARACTER::ClearTarget()':
char.cpp:5680: error: 'TPacketGCTarget' was not declared in this scope
char.cpp:5680: error: expected `;' before 'p'
char.cpp:5682: error: 'p' was not declared in this scope
char.cpp: In member function 'void CHARACTER::SetTarget(CHARACTER*)':
char.cpp:5721: error: 'TPacketGCTarget' was not declared in this scope
char.cpp:5721: error: expected `;' before 'p'
char.cpp:5722: error: 'p' was not declared in this scope
char.cpp: In member function 'void CHARACTER::BroadcastTargetPacket()':
char.cpp:5827: error: 'TPacketGCTarget' was not declared in this scope
char.cpp:5827: error: expected `;' before 'p'
char.cpp:5828: error: 'p' was not declared in this scope
gmake: *** [OBJDIR/battle.o] Error 1
gmake: *** [OBJDIR/building.o] Error 1
gmake: *** [OBJDIR/char_battle.o] Error 1
gmake: *** [OBJDIR/char.o] Error 1
gmake: *** [OBJDIR/char_item.o] Error 1
root@:/usr/sursa/Server/game/src # In file included from arena.cpp:4:
In: Command not found.
root@:/usr/sursa/Server/game/src # packet.herror: duplicate 'typedef'
packet.h: Too many arguments.
root@:/usr/sursa/Server/game/src # packet.herror: two or more data types in declaration of 'TPacketGCTargetInfo'
packet.h: Too many arguments.
root@:/usr/sursa/Server/game/src # packet.herror: expected unqualified-id before '{' token
packet.h: Too many arguments.
root@:/usr/sursa/Server/game/src # packet.herror: expected constructor, destructor, or type conversion before ';' token
packet.h: Too many arguments.
root@:/usr/sursa/Server/game/src # In file included from packet_info.h:4,
In: Command not found.
root@:/usr/sursa/Server/game/src # from input.h:4,
from: can't read /var/mail/input.h:4,
root@:/usr/sursa/Server/game/src # from desc.h:5,
from: can't read /var/mail/desc.h:5,
root@:/usr/sursa/Server/game/src # from battle.cpp:4:
from: can't read /var/mail/battle.cpp:4:
root@:/usr/sursa/Server/game/src # packet.herror: duplicate 'typedef'
packet.h: Too many arguments.
root@:/usr/sursa/Server/game/src # packet.herror: two or more data types in declaration of 'TPacketGCTargetInfo'
packet.h: Too many arguments.
root@:/usr/sursa/Server/game/src # packet.herror: expected unqualified-id before '{' token
packet.h: Too many arguments.
root@:/usr/sursa/Server/game/src # packet.herror: expected constructor, destructor, or type conversion before ';' token
packet.h: Too many arguments.
root@:/usr/sursa/Server/game/src # In file included from packet_info.h:4,
In: Command not found.
root@:/usr/sursa/Server/game/src # from input.h:4,
from: can't read /var/mail/input.h:4,
root@:/usr/sursa/Server/game/src # from desc.h:5,
from: can't read /var/mail/desc.h:5,
root@:/usr/sursa/Server/game/src # from char_battle.cpp:4:
from: can't read /var/mail/char_battle.cpp:4:
root@:/usr/sursa/Server/game/src # packet.herror: duplicate 'typedef'
packet.h: Too many arguments.
root@:/usr/sursa/Server/game/src # packet.herror: two or more data types in declaration of 'TPacketGCTargetInfo'
packet.h: Too many arguments.
root@:/usr/sursa/Server/game/src # packet.herror: expected unqualified-id before '{' token
packet.h: Too many arguments.
root@:/usr/sursa/Server/game/src # packet.herror: expected constructor, destructor, or type conversion before ';' token
packet.h: Too many arguments.
root@:/usr/sursa/Server/game/src # [BEST Pro Game] Derleniyor: char_resist.cpp
[BEST: Command not found.
root@:/usr/sursa/Server/game/src # [BEST Pro Game] Derleniyor: char_skill.cpp
[BEST: Command not found.
root@:/usr/sursa/Server/game/src # [BEST Pro Game] Derleniyor: char_state.cpp
[BEST: Command not found.
root@:/usr/sursa/Server/game/src # In file included from OXEvent.cpp:6:
In: Command not found.
root@:/usr/sursa/Server/game/src # packet.herror: duplicate 'typedef'
packet.h: Too many arguments.
root@:/usr/sursa/Server/game/src # packet.herror: two or more data types in declaration of 'TPacketGCTargetInfo'
packet.h: Too many arguments.
root@:/usr/sursa/Server/game/src # packet.herror: expected unqualified-id before '{' token
packet.h: Too many arguments.
root@:/usr/sursa/Server/game/src # packet.herror: expected constructor, destructor, or type conversion before ';' token
packet.h: Too many arguments.
root@:/usr/sursa/Server/game/src # [BEST Pro Game] Derleniyor: PetSystem.cpp
[BEST: Command not found.
root@:/usr/sursa/Server/game/src # gmake: *** [OBJDIR/OXEvent.o] Error 1
gmake:: Too many arguments.
root@:/usr/sursa/Server/game/src # gmake: *** Waiting for unfinished jobs....
gmake:: Too many arguments.
root@:/usr/sursa/Server/game/src # In file included from packet_info.h:4,
In: Command not found.
root@:/usr/sursa/Server/game/src # from input.h:4,
from: can't read /var/mail/input.h:4,
root@:/usr/sursa/Server/game/src # from desc.h:5,
from: can't read /var/mail/desc.h:5,
root@:/usr/sursa/Server/game/src # from char_item.cpp:10:
from: can't read /var/mail/char_item.cpp:10:
root@:/usr/sursa/Server/game/src # packet.herror: duplicate 'typedef'
packet.h: Too many arguments.
root@:/usr/sursa/Server/game/src # packet.herror: two or more data types in declaration of 'TPacketGCTargetInfo'
packet.h: Too many arguments.
root@:/usr/sursa/Server/game/src # packet.herror: expected unqualified-id before '{' token
packet.h: Too many arguments.
root@:/usr/sursa/Server/game/src # packet.herror: expected constructor, destructor, or type conversion before ';' token
packet.h: Too many arguments.
root@:/usr/sursa/Server/game/src # In file included from packet_info.h:4,
In: Command not found.
root@:/usr/sursa/Server/game/src # from input.h:4,
from: can't read /var/mail/input.h:4,
root@:/usr/sursa/Server/game/src # from desc.h:5,
from: can't read /var/mail/desc.h:5,
root@:/usr/sursa/Server/game/src # from char_skill.cpp:10:
from: can't read /var/mail/char_skill.cpp:10:
root@:/usr/sursa/Server/game/src # packet.herror: duplicate 'typedef'
packet.h: Too many arguments.
root@:/usr/sursa/Server/game/src # packet.herror: two or more data types in declaration of 'TPacketGCTargetInfo'
packet.h: Too many arguments.
root@:/usr/sursa/Server/game/src # packet.herror: expected unqualified-id before '{' token
packet.h: Too many arguments.
root@:/usr/sursa/Server/game/src # packet.herror: expected constructor, destructor, or type conversion before ';' token
packet.h: Too many arguments.
root@:/usr/sursa/Server/game/src # In file included from packet_info.h:4,
In: Command not found.
root@:/usr/sursa/Server/game/src # from input.h:4,
from: can't read /var/mail/input.h:4,
root@:/usr/sursa/Server/game/src # from desc.h:5,
from: can't read /var/mail/desc.h:5,
root@:/usr/sursa/Server/game/src # from char_quickslot.cpp:4:
from: can't read /var/mail/char_quickslot.cpp:4:
root@:/usr/sursa/Server/game/src # packet.herror: duplicate 'typedef'
packet.h: Too many arguments.
root@:/usr/sursa/Server/game/src # packet.herror: two or more data types in declaration of 'TPacketGCTargetInfo'
packet.h: Too many arguments.
root@:/usr/sursa/Server/game/src # packet.herror: expected unqualified-id before '{' token
packet.h: Too many arguments.
root@:/usr/sursa/Server/game/src # packet.herror: expected constructor, destructor, or type conversion before ';' token
packet.h: Too many arguments.
root@:/usr/sursa/Server/game/src # In file included from packet_info.h:4,
In: Command not found.
root@:/usr/sursa/Server/game/src # from input.h:4,
from: can't read /var/mail/input.h:4,
root@:/usr/sursa/Server/game/src # from desc.h:5,
from: can't read /var/mail/desc.h:5,
root@:/usr/sursa/Server/game/src # from char_manager.cpp:4:
from: can't read /var/mail/char_manager.cpp:4:
root@:/usr/sursa/Server/game/src # packet.herror: duplicate 'typedef'
packet.h: Too many arguments.
root@:/usr/sursa/Server/game/src # packet.herror: two or more data types in declaration of 'TPacketGCTargetInfo'
packet.h: Too many arguments.
root@:/usr/sursa/Server/game/src # packet.herror: expected unqualified-id before '{' token
packet.h: Too many arguments.
root@:/usr/sursa/Server/game/src # packet.herror: expected constructor, destructor, or type conversion before ';' token
packet.h: Too many arguments.
root@:/usr/sursa/Server/game/src # In file included from building.cpp:7:
In: Command not found.
root@:/usr/sursa/Server/game/src # packet.herror: duplicate 'typedef'
packet.h: Too many arguments.
root@:/usr/sursa/Server/game/src # packet.herror: two or more data types in declaration of 'TPacketGCTargetInfo'
packet.h: Too many arguments.
root@:/usr/sursa/Server/game/src # packet.herror: expected unqualified-id before '{' token
packet.h: Too many arguments.
root@:/usr/sursa/Server/game/src # packet.herror: expected constructor, destructor, or type conversion before ';' token
packet.h: Too many arguments.
root@:/usr/sursa/Server/game/src # In file included from char_affect.cpp:8:
In: Command not found.
root@:/usr/sursa/Server/game/src # packet.herror: duplicate 'typedef'
packet.h: Too many arguments.
root@:/usr/sursa/Server/game/src # packet.herror: two or more data types in declaration of 'TPacketGCTargetInfo'
packet.h: Too many arguments.
root@:/usr/sursa/Server/game/src # packet.herror: expected unqualified-id before '{' token
packet.h: Too many arguments.
root@:/usr/sursa/Server/game/src # packet.herror: expected constructor, destructor, or type conversion before ';' token
packet.h: Too many arguments.
root@:/usr/sursa/Server/game/src # In file included from packet_info.h:4,
In: Command not found.
root@:/usr/sursa/Server/game/src # from input.h:4,
from: can't read /var/mail/input.h:4,
root@:/usr/sursa/Server/game/src # from desc.h:5,
from: can't read /var/mail/desc.h:5,
root@:/usr/sursa/Server/game/src # from desc_client.h:4,
from: can't read /var/mail/desc_client.h:4,
root@:/usr/sursa/Server/game/src # from char.cpp:9:
from: can't read /var/mail/char.cpp:9:
root@:/usr/sursa/Server/game/src # packet.herror: duplicate 'typedef'
packet.h: Too many arguments.
root@:/usr/sursa/Server/game/src # packet.herror: two or more data types in declaration of 'TPacketGCTargetInfo'
packet.h: Too many arguments.
root@:/usr/sursa/Server/game/src # packet.herror: expected unqualified-id before '{' token
packet.h: Too many arguments.
root@:/usr/sursa/Server/game/src # packet.herror: expected constructor, destructor, or type conversion before ';' token
packet.h: Too many arguments.
root@:/usr/sursa/Server/game/src # In file included from char_horse.cpp:5:
In: Command not found.
root@:/usr/sursa/Server/game/src # packet.herror: duplicate 'typedef'
packet.h: Too many arguments.
root@:/usr/sursa/Server/game/src # packet.herror: two or more data types in declaration of 'TPacketGCTargetInfo'
packet.h: Too many arguments.
root@:/usr/sursa/Server/game/src # packet.herror: expected unqualified-id before '{' token
packet.h: Too many arguments.
root@:/usr/sursa/Server/game/src # packet.herror: expected constructor, destructor, or type conversion before ';' token
packet.h: Too many arguments.
root@:/usr/sursa/Server/game/src # gmake: *** [OBJDIR/arena.o] Error 1
gmake:: Too many arguments.
root@:/usr/sursa/Server/game/src # gmake: *** [OBJDIR/char_skill.o] Error 1
gmake:: Too many arguments.
root@:/usr/sursa/Server/game/src # In file included from char_state.cpp:8:
In: Command not found.
root@:/usr/sursa/Server/game/src # packet.herror: duplicate 'typedef'
packet.h: Too many arguments.
root@:/usr/sursa/Server/game/src # packet.herror: two or more data types in declaration of 'TPacketGCTargetInfo'
packet.h: Too many arguments.
root@:/usr/sursa/Server/game/src # packet.herror: expected unqualified-id before '{' token
packet.h: Too many arguments.
root@:/usr/sursa/Server/game/src # packet.herror: expected constructor, destructor, or type conversion before ';' token
packet.h: Too many arguments.
root@:/usr/sursa/Server/game/src # In file included from PetSystem.cpp:10:
In: Command not found.
root@:/usr/sursa/Server/game/src # packet.herror: duplicate 'typedef'
packet.h: Too many arguments.
root@:/usr/sursa/Server/game/src # packet.herror: two or more data types in declaration of 'TPacketGCTargetInfo'
packet.h: Too many arguments.
root@:/usr/sursa/Server/game/src # packet.herror: expected unqualified-id before '{' token
packet.h: Too many arguments.
root@:/usr/sursa/Server/game/src # packet.herror: expected constructor, destructor, or type conversion before ';' token
packet.h: Too many arguments.
root@:/usr/sursa/Server/game/src # gmake: *** [OBJDIR/PetSystem.o] Error 1
gmake:: Too many arguments.
root@:/usr/sursa/Server/game/src # gmake: *** [OBJDIR/char_state.o] Error 1
gmake:: Too many arguments.
root@:/usr/sursa/Server/game/src # gmake: *** [OBJDIR/char_manager.o] Error 1
gmake:: Too many arguments.
root@:/usr/sursa/Server/game/src # gmake: *** [OBJDIR/char_horse.o] Error 1
gmake:: Too many arguments.
root@:/usr/sursa/Server/game/src # gmake: *** [OBJDIR/char_quickslot.o] Error 1
gmake:: Too many arguments.
root@:/usr/sursa/Server/game/src # gmake: *** [OBJDIR/char_affect.o] Error 1
gmake:: Too many arguments.
root@:/usr/sursa/Server/game/src # char.cpp: In member function 'void CHARACTER::ClearTarget()':
char.cpp:: Too many arguments.
root@:/usr/sursa/Server/game/src # char.cpp:5680: error: 'TPacketGCTarget' was not declared in this scope
char.cpp:5680:: Too many arguments.
root@:/usr/sursa/Server/game/src # char.cpp:5680: error: expected `;' before 'p'
Unmatched `.
root@:/usr/sursa/Server/game/src # char.cpp:5682: error: 'p' was not declared in this scope
char.cpp:5682:: Too many arguments.
root@:/usr/sursa/Server/game/src # char.cpp: In member function 'void CHARACTER::SetTarget(CHARACTER*)':
char.cpp:: Too many arguments.
root@:/usr/sursa/Server/game/src # char.cpp:5721: error: 'TPacketGCTarget' was not declared in this scope
char.cpp:5721:: Too many arguments.
root@:/usr/sursa/Server/game/src # char.cpp:5721: error: expected `;' before 'p'
Unmatched `.
root@:/usr/sursa/Server/game/src # char.cpp:5722: error: 'p' was not declared in this scope
char.cpp:5722:: Too many arguments.
root@:/usr/sursa/Server/game/src # char.cpp: In member function 'void CHARACTER::BroadcastTargetPacket()':
char.cpp:: Too many arguments.
root@:/usr/sursa/Server/game/src # char.cpp:5827: error: 'TPacketGCTarget' was not declared in this scope
char.cpp:5827:: Too many arguments.
root@:/usr/sursa/Server/game/src # char.cpp:5827: error: expected `;' before 'p'
Unmatched `.
root@:/usr/sursa/Server/game/src # char.cpp:5828: error: 'p' was not declared in this scope
char.cpp:5828:: Too many arguments.
root@:/usr/sursa/Server/game/src # gmake: *** [OBJDIR/battle.o] Error 1
gmake:: Too many arguments.
root@:/usr/sursa/Server/game/src # gmake: *** [OBJDIR/building.o] Error 1
gmake:: Too many arguments.
root@:/usr/sursa/Server/game/src # gmake: *** [OBJDIR/char_battle.o] Error 1
gmake:: Too many arguments.
root@:/usr/sursa/Server/game/src # gmake: *** [OBJDIR/char.o] Error 1
gmake:: Too many arguments.
root@:/usr/sursa/Server/game/src # gmake: *** [OBJDIR/char_item.o] Error 1
gmake:: Too many arguments.


