O mica problema

Totalitatea subiectelor care nu respectă regulamentul impus in sectiunea "Probleme şi Întrebări" vor fi stocate aici.
Închis
Avatar utilizator
noone21
Nivel 1

Nivel 1
Mesaje: 110
Membru din: 13 Iul 2017, 16:28
Aprecieri: 2  
Mulţumiri: 0
Medalii

Problemă: Primesc niste erori la compilare char.cpp
Tipologie server(PvM / PvP): PVM
Resursă folosită: -
ServerFiles utilizat: 40k
Syserr:
char.cpp: In member function 'void CHARACTER::OnClick(CHARACTER*)':
char.cpp:5921: error: a function-definition is not allowed here before '{' token
char.cpp:5928: error: a function-definition is not allowed here before '{' token
char.cpp:8168: error: expected `}' at end of input
gmake: *** [OBJDIR/char.o] Error 1}
Poză: -
Detalii suplimentare: Va rog frumos sa ma ajutati.
Avatar utilizator
KinKade
Membru Club

Membru Club
Mesaje: 1224
Membru din: 10 Mar 2014, 19:39
Server: Quirin2
Regat: Jinno
Aprecieri: 132  
Mulţumiri: 55  
Discord: Copiază ID
 Contact:
Medalii

Pune-mi char.cpp ti-l fac eu
Discord: Koshmar#3873
Afișează semnătura
Avatar utilizator
noone21
Nivel 1

Nivel 1
Mesaje: 110
Membru din: 13 Iul 2017, 16:28
Aprecieri: 2  
Mulţumiri: 0
Medalii

Poftim :
Avatar utilizator
noone21
Nivel 1

Nivel 1
Mesaje: 110
Membru din: 13 Iul 2017, 16:28
Aprecieri: 2  
Mulţumiri: 0
Medalii

UP
Avatar utilizator
[ST]SSH
Membru Club

Membru Club
Mesaje: 1704
Membru din: 12 Apr 2016, 23:54
Server: Fost Eluria2
Regat: Jinno
Aprecieri: 132  
Mulţumiri: 245  
 Contact:
Medalii

Arhivat!
Închis
Răspunsuri
1
Vizualizări
294
Răspunsuri
3
Vizualizări
276
Răspunsuri
5
Vizualizări
441
Răspunsuri
3
Vizualizări
162

Înapoi la “Arhivă Probleme şi Întrebări”

  • Informaţie
  • Cine este conectat

    Utilizatori ce ce navighează pe acest forum: Niciun utilizator înregistrat și 53 vizitatori