Problemă: Primesc niste erori la compilare char.cpp
Tipologie server(PvM / PvP): PVM
Resursă folosită: -
ServerFiles utilizat: 40k
Syserr:
char.cpp: In member function 'void CHARACTER::OnClick(CHARACTER*)':
char.cpp:5921: error: a function-definition is not allowed here before '{' token
char.cpp:5928: error: a function-definition is not allowed here before '{' token
char.cpp:8168: error: expected `}' at end of input
gmake: *** [OBJDIR/char.o] Error 1}
Poză: -
Detalii suplimentare: Va rog frumos sa ma ajutati.
O mica problema
- KinKade
-

- Mesaje: 1224
- Membru din: 10 Mar 2014, 19:39
- Server: Quirin2
- Regat: Jinno
- Aprecieri: 132
- Mulţumiri: 55
- Discord: Copiază ID
- Contact:
Pune-mi char.cpp ti-l fac eu
-
- Informaţie
-
Cine este conectat
Utilizatori ce ce navighează pe acest forum: Google [Bot] și 81 vizitatori
