compile New_PetSystem.cpp
New_PetSystem.cpp

2: warning: no newline at end of file
New_PetSystem.cpp: In member function 'void CNewPetActor::SetExp(DWORD, int)':
New_PetSystem.cpp:321: warning: comparison between signed and unsigned integer expressions
New_PetSystem.cpp:321: warning: comparison between signed and unsigned integer expressions
New_PetSystem.cpp:330: warning: comparison between signed and unsigned integer expressions
New_PetSystem.cpp:330: warning: comparison between signed and unsigned integer expressions
New_PetSystem.cpp:340: warning: comparison between signed and unsigned integer expressions
New_PetSystem.cpp:341: warning: comparison between signed and unsigned integer expressions
New_PetSystem.cpp:361: warning: comparison between signed and unsigned integer expressions
New_PetSystem.cpp:364: warning: comparison between signed and unsigned integer expressions
New_PetSystem.cpp:367: warning: comparison between signed and unsigned integer expressions
New_PetSystem.cpp:373: warning: comparison between signed and unsigned integer expressions
New_PetSystem.cpp:374: warning: comparison between signed and unsigned integer expressions
New_PetSystem.cpp:385: warning: comparison between signed and unsigned integer expressions
New_PetSystem.cpp: In member function 'DWORD CNewPetActor::Summon(const char*, CItem*, bool)':
New_PetSystem.cpp:529: warning: format '%lu' expects type 'long unsigned int', but argument 4 has type 'DWORD'
New_PetSystem.cpp:529: warning: format '%lu' expects type 'long unsigned int', but argument 4 has type 'DWORD'
New_PetSystem.cpp: In member function 'virtual bool CNewPetActor::_UpdateFollowAI()':
New_PetSystem.cpp:645: warning: unused variable 'bDoMoveAlone'
New_PetSystem.cpp: In member function 'CNewPetActor* CNewPetSystem::Summon(DWORD, CItem*, const char*, bool, DW ORD)':
New_PetSystem.cpp

warning: unused variable 'petVID'
compile questlua_petnew.cpp
questlua_petnew.cpp:286:2: warning: no newline at end of file
compile main.cpp
compile minilzo.c
main.cpp: In function 'int main(int, char**)':
main.cpp:590: error: redeclaration of 'std::string temp_exp_line'
main.cpp:568: error: 'std::string temp_exp_line' previously declared here
main.cpp:574: warning: unused variable 'tmppet_exp'
gmake: *** [OBJDIR/main.o] Error 1