Tipologie server: pvm
*Resursă folosită: j4m
*ServerFiles utilizat: j4m
*Syserr: -
Poză:-
*Detalii suplimentare:
[Endlles] [Endlles] Compiling: BattleArena.cpp In file included from BattleArena.cpp:1: stdafx.h:16:38: error: cryptopp/cryptoppLibLink.h: No such file or directory In file included from stdafx.h:44, from BattleArena.cpp:1: event.h:10:35: error: boost/intrusive_ptr.hpp: No such file or directory In file included from BattleArena.cpp:7: char.h:4:35: error: boost/unordered_map.hpp: No such file or directory In file included from stdafx.h:44, from BattleArena.cpp:1: event.h:37: error: 'boost' has not been declared event.h:37: error: expected initializer before '<' token event.h:38: error: typedef 'TEVENTFUNC' is initialized (use __typeof__ instead) event.h:38: error: 'LPEVENT' was not declared in this scope event.h:38: error: expected primary-expression before 'long' event.h:57: error: 'TEVENTFUNC' does not name a type event.h: In constructor 'event::event()': event.h:47: error: class 'event' does not have any field named 'func' event.h: At global scope: event.h:83: error: 'LPEVENT' does not name a type event.h:84: error: variable or field 'event_cancel' declared void event.h:84: error: 'LPEVENT' was not declared in this scope event.h:84: error: expected primary-expression before ')' token event.h:85: error: 'LPEVENT' was not declared in this scope event.h:86: error: 'LPEVENT' was not declared in this scope event.h:87: error: variable or field 'event_reset_time' declared void event.h:87: error: 'LPEVENT' was not declared in this scope event.h:87: error: expected primary-expression before 'long' event.h:91: error: 'LPEVENT' was not declared in this scope In file included from BattleArena.cpp:4: BattleArena.h:21: error: 'LPEVENT' does not name a type In file included from char.h:9, from BattleArena.cpp:7: horse_rider.h:92: error: 'LPEVENT' does not name a type horse_rider.h:93: error: 'LPEVENT' does not name a type horse_rider.h:95: error: 'LPEVENT' has not been declared horse_rider.h:96: error: 'LPEVENT' has not been declared In file included from char.h:15, from BattleArena.cpp:7: mining.h:6: error: 'LPEVENT' does not name a type In file included from BattleArena.cpp:7: char.h:518: error: 'boost' has not been declared char.h:518: error: ISO C++ forbids declaration of 'unordered_map' with no type char.h:518: error: expected ';' before '<' token In file included from BattleArena.cpp:7: char.herror: 'LPEVENT' has not been declared char.h
error: 'LPEVENT' does not name a type char.h
error: 'LPEVENT' was not declared in this scope char.h
error: template argument 2 is invalid char.h
error: template argument 4 is invalid char.h
error: 'LPEVENT' does not name a type char.h
error: 'boost' has not been declared char.h
error: ISO C++ forbids declaration of 'unordered_map' with no type char.h
error: expected ';' before '<' token char.h
error: 'LPEVENT' does not name a type char.h
error: 'LPEVENT' does not name a type char.h
error: 'LPEVENT' does not name a type char.h
error: 'LPEVENT' does not name a type char.h
error: 'LPEVENT' does not name a type char.h
error: 'LPEVENT' does not name a type char.h
error: 'LPEVENT' does not name a type char.h
error: 'LPEVENT' does not name a type char.h
error: 'LPEVENT' does not name a type char.h
error: 'LPEVENT' does not name a type char.h
error: 'LPEVENT' does not name a type char.h
error: 'LPEVENT' does not name a type char.h
error: 'LPEVENT' does not name a type char.h
error: 'LPEVENT' does not name a type char.h
error: 'LPEVENT' does not name a type char.h
error: 'LPEVENT' does not name a type char.h
error: 'LPEVENT' was not declared in this scope char.h
error: template argument 2 is invalid char.h
error: template argument 4 is invalid char.h
error: 'LPEVENT' does not name a type char.h
error: 'LPEVENT' does not name a type char.h
error: 'LPEVENT' does not name a type char.h: In member function 'void CHARACTER::SetPartyRequestEvent(int)': char.h
error: 'm_pkPartyRequestEvent' was not declared in this scope char.h: In member function 'bool CHARACTER::IsWarping() const': char.h
error: 'm_pkWarpEvent' was not declared in this scope In file included from sectree_manager.h:4, from BattleArena.cpp:8: sectree.h: At global scope: sectree.h:166: error: 'LPEVENT' has not been declared In file included from regen.h:1, from BattleArena.cpp:9: dungeon.h:160: error: 'LPEVENT' does not name a type dungeon.h:162: error: 'LPEVENT' does not name a type dungeon.h:163: error: 'LPEVENT' does not name a type dungeon.h:167: error: 'LPEVENT' has not been declared dungeon.h:169: error: 'LPEVENT' has not been declared dungeon.h:170: error: 'LPEVENT' has not been declared In file included from BattleArena.cpp:9: regen.h:31: error: 'LPEVENT' does not name a type regen.h: In constructor 'regen::regen()': regen.h:47: error: type 'event' is not a direct base of 'regen' In file included from questnpc.h:4, from questmanager.h:6, from BattleArena.cpp:10: questpc.h: At global scope: questpc.h:107: error: 'LPEVENT' has not been declared questpc.h:175: error: 'LPEVENT' was not declared in this scope questpc.h:175: error: template argument 2 is invalid questpc.h:175: error: template argument 4 is invalid In file included from BattleArena.cpp:10: questmanager.h:108: error: 'LPEVENT' has not been declared questmanager.h:225: error: 'LPEVENT' was not declared in this scope questmanager.h:225: error: template argument 2 is invalid questmanager.h:225: error: template argument 4 is invalid questmanager.h:280: error: 'boost' has not been declared questmanager.h:280: error: ISO C++ forbids declaration of 'unordered_map' with no type questmanager.h:280: error: typedef name may not be a nested-name-specifier questmanager.h:280: error: expected ';' before '<' token questmanager.h:281: error: 'boost' has not been declared questmanager.h:281: error: ISO C++ forbids declaration of 'unordered_map' with no type questmanager.h:281: error: typedef name may not be a nested-name-specifier questmanager.h:281: error: expected ';' before '<' token questmanager.h:283: error: 'THashMapQuestName' does not name a type questmanager.h:284: error: 'THashMapQuestStartScript' does not name a type BattleArena.cpp: In constructor 'CBattleArena::CBattleArena()': BattleArena.cpp:13: error: class 'CBattleArena' does not have any field named 'm_pEvent' BattleArena.cpp: At global scope: BattleArena.cpp:87: error: 'LPEVENT' was not declared in this scope BattleArena.cpp:87: error: expected primary-expression before 'long' BattleArena.cpp:87: error: initializer expression list treated as compound expression BattleArena.cpp:88: error: expected ',' or ';' before '{' token Makefile:190: recipe for target '.obj/BattleArena.o' failed gmake: *** [.obj/BattleArena.o] Error 1 root@:/usr/src/sursa_athora/game/src # gmake [Endlles] Compiling: BattleArena.cpp In file included from BattleArena.cpp:1: stdafx.h:16:38: error: cryptopp/cryptoppLibLink.h: No such file or directory In file included from stdafx.h:44, from BattleArena.cpp:1: event.h:10:35: error: boost/intrusive_ptr.hpp: No such file or directory In file included from BattleArena.cpp:7: char.h:4:35: error: boost/unordered_map.hpp: No such file or directory In file included from stdafx.h:44, from BattleArena.cpp:1: event.h:37: error: 'boost' has not been declared event.h:37: error: expected initializer before '<' token event.h:38: error: typedef 'TEVENTFUNC' is initialized (use __typeof__ instead) event.h:38: error: 'LPEVENT' was not declared in this scope event.h:38: error: expected primary-expression before 'long' event.h:57: error: 'TEVENTFUNC' does not name a type event.h: In constructor 'event::event()': event.h:47: error: class 'event' does not have any field named 'func' event.h: At global scope: event.h:83: error: 'LPEVENT' does not name a type event.h:84: error: variable or field 'event_cancel' declared void event.h:84: error: 'LPEVENT' was not declared in this scope event.h:84: error: expected primary-expression before ')' token event.h:85: error: 'LPEVENT' was not declared in this scope event.h:86: error: 'LPEVENT' was not declared in this scope event.h:87: error: variable or field 'event_reset_time' declared void event.h:87: error: 'LPEVENT' was not declared in this scope event.h:87: error: expected primary-expression before 'long' event.h:91: error: 'LPEVENT' was not declared in this scope In file included from BattleArena.cpp:4: BattleArena.h:21: error: 'LPEVENT' does not name a type In file included from char.h:9, from BattleArena.cpp:7: horse_rider.h:92: error: 'LPEVENT' does not name a type horse_rider.h:93: error: 'LPEVENT' does not name a type horse_rider.h:95: error: 'LPEVENT' has not been declared horse_rider.h:96: error: 'LPEVENT' has not been declared In file included from char.h:15, from BattleArena.cpp:7: mining.h:6: error: 'LPEVENT' does not name a type In file included from BattleArena.cpp:7: char.h:518: error: 'boost' has not been declared char.h:518: error: ISO C++ forbids declaration of 'unordered_map' with no type char.h:518: error: expected ';' before '<' token In file included from BattleArena.cpp:7: char.h
error: 'LPEVENT' has not been declared char.h
error: 'LPEVENT' does not name a type char.h
error: 'LPEVENT' was not declared in this scope char.h
error: template argument 2 is invalid char.h
error: template argument 4 is invalid char.h
error: 'LPEVENT' does not name a type char.h
error: 'boost' has not been declared char.h
error: ISO C++ forbids declaration of 'unordered_map' with no type char.h
error: expected ';' before '<' token char.h
error: 'LPEVENT' does not name a type char.h
error: 'LPEVENT' does not name a type char.h
error: 'LPEVENT' does not name a type char.h
error: 'LPEVENT' does not name a type char.h
error: 'LPEVENT' does not name a type char.h
error: 'LPEVENT' does not name a type char.h
error: 'LPEVENT' does not name a type char.h
error: 'LPEVENT' does not name a type char.h
error: 'LPEVENT' does not name a type char.h
error: 'LPEVENT' does not name a type char.h
error: 'LPEVENT' does not name a type char.h
error: 'LPEVENT' does not name a type char.h
error: 'LPEVENT' does not name a type char.h
error: 'LPEVENT' does not name a type char.h
error: 'LPEVENT' does not name a type char.h
error: 'LPEVENT' does not name a type char.h
error: 'LPEVENT' was not declared in this scope char.h
error: template argument 2 is invalid char.h
error: template argument 4 is invalid char.h
error: 'LPEVENT' does not name a type char.h
error: 'LPEVENT' does not name a type char.h
error: 'LPEVENT' does not name a type char.h: In member function 'void CHARACTER::SetPartyRequestEvent(int)': char.h
error: 'm_pkPartyRequestEvent' was not declared in this scope char.h: In member function 'bool CHARACTER::IsWarping() const': char.h
error: 'm_pkWarpEvent' was not declared in this scope In file included from sectree_manager.h:4, from BattleArena.cpp:8: sectree.h: At global scope: sectree.h:166: error: 'LPEVENT' has not been declared In file included from regen.h:1, from BattleArena.cpp:9: dungeon.h:160: error: 'LPEVENT' does not name a type dungeon.h:162: error: 'LPEVENT' does not name a type dungeon.h:163: error: 'LPEVENT' does not name a type dungeon.h:167: error: 'LPEVENT' has not been declared dungeon.h:169: error: 'LPEVENT' has not been declared dungeon.h:170: error: 'LPEVENT' has not been declared In file included from BattleArena.cpp:9: regen.h:31: error: 'LPEVENT' does not name a type regen.h: In constructor 'regen::regen()': regen.h:47: error: type 'event' is not a direct base of 'regen' In file included from questnpc.h:4, from questmanager.h:6, from BattleArena.cpp:10: questpc.h: At global scope: questpc.h:107: error: 'LPEVENT' has not been declared questpc.h:175: error: 'LPEVENT' was not declared in this scope questpc.h:175: error: template argument 2 is invalid questpc.h:175: error: template argument 4 is invalid In file included from BattleArena.cpp:10: questmanager.h:108: error: 'LPEVENT' has not been declared questmanager.h:225: error: 'LPEVENT' was not declared in this scope questmanager.h:225: error: template argument 2 is invalid questmanager.h:225: error: template argument 4 is invalid questmanager.h:280: error: 'boost' has not been declared questmanager.h:280: error: ISO C++ forbids declaration of 'unordered_map' with no type questmanager.h:280: error: typedef name may not be a nested-name-specifier questmanager.h:280: error: expected ';' before '<' token questmanager.h:281: error: 'boost' has not been declared questmanager.h:281: error: ISO C++ forbids declaration of 'unordered_map' with no type questmanager.h:281: error: typedef name may not be a nested-name-specifier questmanager.h:281: error: expected ';' before '<' token questmanager.h:283: error: 'THashMapQuestName' does not name a type questmanager.h:284: error: 'THashMapQuestStartScript' does not name a type BattleArena.cpp: In constructor 'CBattleArena::CBattleArena()': BattleArena.cpp:13: error: class 'CBattleArena' does not have any field named 'm_pEvent' BattleArena.cpp: At global scope: BattleArena.cpp:87: error: 'LPEVENT' was not declared in this scope BattleArena.cpp:87: error: expected primary-expression before 'long' BattleArena.cpp:87: error: initializer expression list treated as compound expression BattleArena.cpp:88: error: expected ',' or ';' before '{' token Makefile:190: recipe for target '.obj/BattleArena.o' failed gmake: *** [.obj/BattleArena.o] Error 1 root@:/usr/src/sursa_athora/game/src # clear root@:/usr/src/sursa_athora/game/src # cd /usr root@:/usr # rm -rf usr root@:/usr # cd /usr/src/sursa_athora/game/src root@:/usr/src/sursa_athora/game/src # gmake clean root@:/usr/src/sursa_athora/game/src # gmake dep Note: gcc autodepend is autodetected, so target dep skipped root@:/usr/src/sursa_athora/game/src # root@:/usr/src/sursa_athora/game/src # gmake [Endlles] Compiling: BattleArena.cpp In file included from BattleArena.cpp:1: stdafx.h:16:38: error: cryptopp/cryptoppLibLink.h: No such file or directory In file included from stdafx.h:44, from BattleArena.cpp:1: event.h:10:35: error: boost/intrusive_ptr.hpp: No such file or directory In file included from BattleArena.cpp:7: char.h:4:35: error: boost/unordered_map.hpp: No such file or directory In file included from stdafx.h:44, from BattleArena.cpp:1: event.h:37: error: 'boost' has not been declared event.h:37: error: expected initializer before '<' token event.h:38: error: typedef 'TEVENTFUNC' is initialized (use __typeof__ instead) event.h:38: error: 'LPEVENT' was not declared in this scope event.h:38: error: expected primary-expression before 'long' event.h:57: error: 'TEVENTFUNC' does not name a type event.h: In constructor 'event::event()': event.h:47: error: class 'event' does not have any field named 'func' event.h: At global scope: event.h:83: error: 'LPEVENT' does not name a type event.h:84: error: variable or field 'event_cancel' declared void event.h:84: error: 'LPEVENT' was not declared in this scope event.h:84: error: expected primary-expression before ')' token event.h:85: error: 'LPEVENT' was not declared in this scope event.h:86: error: 'LPEVENT' was not declared in this scope event.h:87: error: variable or field 'event_reset_time' declared void event.h:87: error: 'LPEVENT' was not declared in this scope event.h:87: error: expected primary-expression before 'long' event.h:91: error: 'LPEVENT' was not declared in this scope In file included from BattleArena.cpp:4: BattleArena.h:21: error: 'LPEVENT' does not name a type In file included from char.h:9, from BattleArena.cpp:7: horse_rider.h:92: error: 'LPEVENT' does not name a type horse_rider.h:93: error: 'LPEVENT' does not name a type horse_rider.h:95: error: 'LPEVENT' has not been declared horse_rider.h:96: error: 'LPEVENT' has not been declared In file included from char.h:15, from BattleArena.cpp:7: mining.h:6: error: 'LPEVENT' does not name a type In file included from BattleArena.cpp:7: char.h:518: error: 'boost' has not been declared char.h:518: error: ISO C++ forbids declaration of 'unordered_map' with no type char.h:518: error: expected ';' before '<' token In file included from BattleArena.cpp:7: char.h
error: 'LPEVENT' has not been declared char.h
error: 'LPEVENT' does not name a type char.h
error: 'LPEVENT' was not declared in this scope char.h
error: template argument 2 is invalid char.h
error: template argument 4 is invalid char.h
error: 'LPEVENT' does not name a type char.h
error: 'boost' has not been declared char.h
error: ISO C++ forbids declaration of 'unordered_map' with no type char.h
error: expected ';' before '<' token char.h
error: 'LPEVENT' does not name a type char.h
error: 'LPEVENT' does not name a type char.h
error: 'LPEVENT' does not name a type char.h
error: 'LPEVENT' does not name a type char.h
error: 'LPEVENT' does not name a type char.h
error: 'LPEVENT' does not name a type char.h
error: 'LPEVENT' does not name a type char.h
error: 'LPEVENT' does not name a type char.h
error: 'LPEVENT' does not name a type char.h
error: 'LPEVENT' does not name a type char.h
error: 'LPEVENT' does not name a type char.h
error: 'LPEVENT' does not name a type char.h
error: 'LPEVENT' does not name a type char.h
error: 'LPEVENT' does not name a type char.h
error: 'LPEVENT' does not name a type char.h
error: 'LPEVENT' does not name a type char.h
error: 'LPEVENT' was not declared in this scope char.h
error: template argument 2 is invalid char.h
error: template argument 4 is invalid char.h
error: 'LPEVENT' does not name a type char.h
error: 'LPEVENT' does not name a type char.h
error: 'LPEVENT' does not name a type char.h: In member function 'void CHARACTER::SetPartyRequestEvent(int)': char.h
error: 'm_pkPartyRequestEvent' was not declared in this scope char.h: In member function 'bool CHARACTER::IsWarping() const': char.h
error: 'm_pkWarpEvent' was not declared in this scope In file included from sectree_manager.h:4, from BattleArena.cpp:8: sectree.h: At global scope: sectree.h:166: error: 'LPEVENT' has not been declared In file included from regen.h:1, from BattleArena.cpp:9: dungeon.h:160: error: 'LPEVENT' does not name a type dungeon.h:162: error: 'LPEVENT' does not name a type dungeon.h:163: error: 'LPEVENT' does not name a type dungeon.h:167: error: 'LPEVENT' has not been declared dungeon.h:169: error: 'LPEVENT' has not been declared dungeon.h:170: error: 'LPEVENT' has not been declared In file included from BattleArena.cpp:9: regen.h:31: error: 'LPEVENT' does not name a type regen.h: In constructor 'regen::regen()': regen.h:47: error: type 'event' is not a direct base of 'regen' In file included from questnpc.h:4, from questmanager.h:6, from BattleArena.cpp:10: questpc.h: At global scope: questpc.h:107: error: 'LPEVENT' has not been declared questpc.h:175: error: 'LPEVENT' was not declared in this scope questpc.h:175: error: template argument 2 is invalid questpc.h:175: error: template argument 4 is invalid In file included from BattleArena.cpp:10: questmanager.h:108: error: 'LPEVENT' has not been declared questmanager.h:225: error: 'LPEVENT' was not declared in this scope questmanager.h:225: error: template argument 2 is invalid questmanager.h:225: error: template argument 4 is invalid questmanager.h:280: error: 'boost' has not been declared questmanager.h:280: error: ISO C++ forbids declaration of 'unordered_map' with no type questmanager.h:280: error: typedef name may not be a nested-name-specifier questmanager.h:280: error: expected ';' before '<' token questmanager.h:281: error: 'boost' has not been declared questmanager.h:281: error: ISO C++ forbids declaration of 'unordered_map' with no type questmanager.h:281: error: typedef name may not be a nested-name-specifier questmanager.h:281: error: expected ';' before '<' token questmanager.h:283: error: 'THashMapQuestName' does not name a type questmanager.h:284: error: 'THashMapQuestStartScript' does not name a type BattleArena.cpp: In constructor 'CBattleArena::CBattleArena()': BattleArena.cpp:13: error: class 'CBattleArena' does not have any field named 'm_pEvent' BattleArena.cpp: At global scope: BattleArena.cpp:87: error: 'LPEVENT' was not declared in this scope BattleArena.cpp:87: error: expected primary-expression before 'long' BattleArena.cpp:87: error: initializer expression list treated as compound expression BattleArena.cpp:88: error: expected ',' or ';' before '{' token Makefile:190: recipe for target '.obj/BattleArena.o' failed gmake: *** [.obj/BattleArena.o] Error 1




