eroare compilare sursa game

Totalitatea subiectelor care nu respectă regulamentul impus in sectiunea "Probleme şi Întrebări" vor fi stocate aici.
Închis
Avatar utilizator
sorrellboss
Nivel 3

Nivel 3
Mesaje: 461
Membru din: 29 Iun 2014, 09:51
Server: Metin2Gorj
Regat: Shinsoo
Aprecieri: 45  
Mulţumiri: 4  
Medalii

*Problemă: compilare sursa error
Tipologie server: pvm
*Resursă folosită: j4m
*ServerFiles utilizat: j4m
*Syserr: -
Poză:-
*Detalii suplimentare:



[Endlles]  [Endlles]         Compiling: BattleArena.cpp
In file included from BattleArena.cpp:1:
stdafx.h:16:38: error: cryptopp/cryptoppLibLink.h: No such file or directory
In file included from stdafx.h:44,
                 from BattleArena.cpp:1:
event.h:10:35: error: boost/intrusive_ptr.hpp: No such file or directory
In file included from BattleArena.cpp:7:
char.h:4:35: error: boost/unordered_map.hpp: No such file or directory
In file included from stdafx.h:44,
                 from BattleArena.cpp:1:
event.h:37: error: 'boost' has not been declared
event.h:37: error: expected initializer before '<' token
event.h:38: error: typedef 'TEVENTFUNC' is initialized (use __typeof__ instead)
event.h:38: error: 'LPEVENT' was not declared in this scope
event.h:38: error: expected primary-expression before 'long'
event.h:57: error: 'TEVENTFUNC' does not name a type
event.h: In constructor 'event::event()':
event.h:47: error: class 'event' does not have any field named 'func'
event.h: At global scope:
event.h:83: error: 'LPEVENT' does not name a type
event.h:84: error: variable or field 'event_cancel' declared void
event.h:84: error: 'LPEVENT' was not declared in this scope
event.h:84: error: expected primary-expression before ')' token
event.h:85: error: 'LPEVENT' was not declared in this scope
event.h:86: error: 'LPEVENT' was not declared in this scope
event.h:87: error: variable or field 'event_reset_time' declared void
event.h:87: error: 'LPEVENT' was not declared in this scope
event.h:87: error: expected primary-expression before 'long'
event.h:91: error: 'LPEVENT' was not declared in this scope
In file included from BattleArena.cpp:4:
BattleArena.h:21: error: 'LPEVENT' does not name a type
In file included from char.h:9,
                 from BattleArena.cpp:7:
horse_rider.h:92: error: 'LPEVENT' does not name a type
horse_rider.h:93: error: 'LPEVENT' does not name a type
horse_rider.h:95: error: 'LPEVENT' has not been declared
horse_rider.h:96: error: 'LPEVENT' has not been declared
In file included from char.h:15,
                 from BattleArena.cpp:7:
mining.h:6: error: 'LPEVENT' does not name a type
In file included from BattleArena.cpp:7:
char.h:518: error: 'boost' has not been declared
char.h:518: error: ISO C++ forbids declaration of 'unordered_map' with no type
char.h:518: error: expected ';' before '<' token
In file included from BattleArena.cpp:7:
char.h:1067: error: 'LPEVENT' has not been declared
char.h:1115: error: 'LPEVENT' does not name a type
char.h:1124: error: 'LPEVENT' was not declared in this scope
char.h:1124: error: template argument 2 is invalid
char.h:1124: error: template argument 4 is invalid
char.h:1563: error: 'LPEVENT' does not name a type
char.h:1592: error: 'boost' has not been declared
char.h:1592: error: ISO C++ forbids declaration of 'unordered_map' with no type
char.h:1592: error: expected ';' before '<' token
char.h:1854: error: 'LPEVENT' does not name a type
char.h:1855: error: 'LPEVENT' does not name a type
char.h:1856: error: 'LPEVENT' does not name a type
char.h:1857: error: 'LPEVENT' does not name a type
char.h:1858: error: 'LPEVENT' does not name a type
char.h:1859: error: 'LPEVENT' does not name a type
char.h:1860: error: 'LPEVENT' does not name a type
char.h:1861: error: 'LPEVENT' does not name a type
char.h:1863: error: 'LPEVENT' does not name a type
char.h:1865: error: 'LPEVENT' does not name a type
char.h:1866: error: 'LPEVENT' does not name a type
char.h:1871: error: 'LPEVENT' does not name a type
char.h:1873: error: 'LPEVENT' does not name a type
char.h:1874: error: 'LPEVENT' does not name a type
char.h:1875: error: 'LPEVENT' does not name a type
char.h:1876: error: 'LPEVENT' does not name a type
char.h:1888: error: 'LPEVENT' was not declared in this scope
char.h:1888: error: template argument 2 is invalid
char.h:1888: error: template argument 4 is invalid
char.h:2114: error: 'LPEVENT' does not name a type
char.h:2276: error: 'LPEVENT' does not name a type
char.h:2284: error: 'LPEVENT' does not name a type
char.h: In member function 'void CHARACTER::SetPartyRequestEvent(int)':
char.h:1067: error: 'm_pkPartyRequestEvent' was not declared in this scope
char.h: In member function 'bool CHARACTER::IsWarping() const':
char.h:1878: error: 'm_pkWarpEvent' was not declared in this scope
In file included from sectree_manager.h:4,
                 from BattleArena.cpp:8:
sectree.h: At global scope:
sectree.h:166: error: 'LPEVENT' has not been declared
In file included from regen.h:1,
                 from BattleArena.cpp:9:
dungeon.h:160: error: 'LPEVENT' does not name a type
dungeon.h:162: error: 'LPEVENT' does not name a type
dungeon.h:163: error: 'LPEVENT' does not name a type
dungeon.h:167: error: 'LPEVENT' has not been declared
dungeon.h:169: error: 'LPEVENT' has not been declared
dungeon.h:170: error: 'LPEVENT' has not been declared
In file included from BattleArena.cpp:9:
regen.h:31: error: 'LPEVENT' does not name a type
regen.h: In constructor 'regen::regen()':
regen.h:47: error: type 'event' is not a direct base of 'regen'
In file included from questnpc.h:4,
                 from questmanager.h:6,
                 from BattleArena.cpp:10:
questpc.h: At global scope:
questpc.h:107: error: 'LPEVENT' has not been declared
questpc.h:175: error: 'LPEVENT' was not declared in this scope
questpc.h:175: error: template argument 2 is invalid
questpc.h:175: error: template argument 4 is invalid
In file included from BattleArena.cpp:10:
questmanager.h:108: error: 'LPEVENT' has not been declared
questmanager.h:225: error: 'LPEVENT' was not declared in this scope
questmanager.h:225: error: template argument 2 is invalid
questmanager.h:225: error: template argument 4 is invalid
questmanager.h:280: error: 'boost' has not been declared
questmanager.h:280: error: ISO C++ forbids declaration of 'unordered_map' with no type
questmanager.h:280: error: typedef name may not be a nested-name-specifier
questmanager.h:280: error: expected ';' before '<' token
questmanager.h:281: error: 'boost' has not been declared
questmanager.h:281: error: ISO C++ forbids declaration of 'unordered_map' with no type
questmanager.h:281: error: typedef name may not be a nested-name-specifier
questmanager.h:281: error: expected ';' before '<' token
questmanager.h:283: error: 'THashMapQuestName' does not name a type
questmanager.h:284: error: 'THashMapQuestStartScript' does not name a type
BattleArena.cpp: In constructor 'CBattleArena::CBattleArena()':
BattleArena.cpp:13: error: class 'CBattleArena' does not have any field named 'm_pEvent'
BattleArena.cpp: At global scope:
BattleArena.cpp:87: error: 'LPEVENT' was not declared in this scope
BattleArena.cpp:87: error: expected primary-expression before 'long'
BattleArena.cpp:87: error: initializer expression list treated as compound expression
BattleArena.cpp:88: error: expected ',' or ';' before '{' token
Makefile:190: recipe for target '.obj/BattleArena.o' failed
gmake: *** [.obj/BattleArena.o] Error 1
root@:/usr/src/sursa_athora/game/src # gmake
 [Endlles]         Compiling: BattleArena.cpp
In file included from BattleArena.cpp:1:
stdafx.h:16:38: error: cryptopp/cryptoppLibLink.h: No such file or directory
In file included from stdafx.h:44,
                 from BattleArena.cpp:1:
event.h:10:35: error: boost/intrusive_ptr.hpp: No such file or directory
In file included from BattleArena.cpp:7:
char.h:4:35: error: boost/unordered_map.hpp: No such file or directory
In file included from stdafx.h:44,
                 from BattleArena.cpp:1:
event.h:37: error: 'boost' has not been declared
event.h:37: error: expected initializer before '<' token
event.h:38: error: typedef 'TEVENTFUNC' is initialized (use __typeof__ instead)
event.h:38: error: 'LPEVENT' was not declared in this scope
event.h:38: error: expected primary-expression before 'long'
event.h:57: error: 'TEVENTFUNC' does not name a type
event.h: In constructor 'event::event()':
event.h:47: error: class 'event' does not have any field named 'func'
event.h: At global scope:
event.h:83: error: 'LPEVENT' does not name a type
event.h:84: error: variable or field 'event_cancel' declared void
event.h:84: error: 'LPEVENT' was not declared in this scope
event.h:84: error: expected primary-expression before ')' token
event.h:85: error: 'LPEVENT' was not declared in this scope
event.h:86: error: 'LPEVENT' was not declared in this scope
event.h:87: error: variable or field 'event_reset_time' declared void
event.h:87: error: 'LPEVENT' was not declared in this scope
event.h:87: error: expected primary-expression before 'long'
event.h:91: error: 'LPEVENT' was not declared in this scope
In file included from BattleArena.cpp:4:
BattleArena.h:21: error: 'LPEVENT' does not name a type
In file included from char.h:9,
                 from BattleArena.cpp:7:
horse_rider.h:92: error: 'LPEVENT' does not name a type
horse_rider.h:93: error: 'LPEVENT' does not name a type
horse_rider.h:95: error: 'LPEVENT' has not been declared
horse_rider.h:96: error: 'LPEVENT' has not been declared
In file included from char.h:15,
                 from BattleArena.cpp:7:
mining.h:6: error: 'LPEVENT' does not name a type
In file included from BattleArena.cpp:7:
char.h:518: error: 'boost' has not been declared
char.h:518: error: ISO C++ forbids declaration of 'unordered_map' with no type
char.h:518: error: expected ';' before '<' token
In file included from BattleArena.cpp:7:
char.h:1067: error: 'LPEVENT' has not been declared
char.h:1115: error: 'LPEVENT' does not name a type
char.h:1124: error: 'LPEVENT' was not declared in this scope
char.h:1124: error: template argument 2 is invalid
char.h:1124: error: template argument 4 is invalid
char.h:1563: error: 'LPEVENT' does not name a type
char.h:1592: error: 'boost' has not been declared
char.h:1592: error: ISO C++ forbids declaration of 'unordered_map' with no type
char.h:1592: error: expected ';' before '<' token
char.h:1854: error: 'LPEVENT' does not name a type
char.h:1855: error: 'LPEVENT' does not name a type
char.h:1856: error: 'LPEVENT' does not name a type
char.h:1857: error: 'LPEVENT' does not name a type
char.h:1858: error: 'LPEVENT' does not name a type
char.h:1859: error: 'LPEVENT' does not name a type
char.h:1860: error: 'LPEVENT' does not name a type
char.h:1861: error: 'LPEVENT' does not name a type
char.h:1863: error: 'LPEVENT' does not name a type
char.h:1865: error: 'LPEVENT' does not name a type
char.h:1866: error: 'LPEVENT' does not name a type
char.h:1871: error: 'LPEVENT' does not name a type
char.h:1873: error: 'LPEVENT' does not name a type
char.h:1874: error: 'LPEVENT' does not name a type
char.h:1875: error: 'LPEVENT' does not name a type
char.h:1876: error: 'LPEVENT' does not name a type
char.h:1888: error: 'LPEVENT' was not declared in this scope
char.h:1888: error: template argument 2 is invalid
char.h:1888: error: template argument 4 is invalid
char.h:2114: error: 'LPEVENT' does not name a type
char.h:2276: error: 'LPEVENT' does not name a type
char.h:2284: error: 'LPEVENT' does not name a type
char.h: In member function 'void CHARACTER::SetPartyRequestEvent(int)':
char.h:1067: error: 'm_pkPartyRequestEvent' was not declared in this scope
char.h: In member function 'bool CHARACTER::IsWarping() const':
char.h:1878: error: 'm_pkWarpEvent' was not declared in this scope
In file included from sectree_manager.h:4,
                 from BattleArena.cpp:8:
sectree.h: At global scope:
sectree.h:166: error: 'LPEVENT' has not been declared
In file included from regen.h:1,
                 from BattleArena.cpp:9:
dungeon.h:160: error: 'LPEVENT' does not name a type
dungeon.h:162: error: 'LPEVENT' does not name a type
dungeon.h:163: error: 'LPEVENT' does not name a type
dungeon.h:167: error: 'LPEVENT' has not been declared
dungeon.h:169: error: 'LPEVENT' has not been declared
dungeon.h:170: error: 'LPEVENT' has not been declared
In file included from BattleArena.cpp:9:
regen.h:31: error: 'LPEVENT' does not name a type
regen.h: In constructor 'regen::regen()':
regen.h:47: error: type 'event' is not a direct base of 'regen'
In file included from questnpc.h:4,
                 from questmanager.h:6,
                 from BattleArena.cpp:10:
questpc.h: At global scope:
questpc.h:107: error: 'LPEVENT' has not been declared
questpc.h:175: error: 'LPEVENT' was not declared in this scope
questpc.h:175: error: template argument 2 is invalid
questpc.h:175: error: template argument 4 is invalid
In file included from BattleArena.cpp:10:
questmanager.h:108: error: 'LPEVENT' has not been declared
questmanager.h:225: error: 'LPEVENT' was not declared in this scope
questmanager.h:225: error: template argument 2 is invalid
questmanager.h:225: error: template argument 4 is invalid
questmanager.h:280: error: 'boost' has not been declared
questmanager.h:280: error: ISO C++ forbids declaration of 'unordered_map' with no type
questmanager.h:280: error: typedef name may not be a nested-name-specifier
questmanager.h:280: error: expected ';' before '<' token
questmanager.h:281: error: 'boost' has not been declared
questmanager.h:281: error: ISO C++ forbids declaration of 'unordered_map' with no type
questmanager.h:281: error: typedef name may not be a nested-name-specifier
questmanager.h:281: error: expected ';' before '<' token
questmanager.h:283: error: 'THashMapQuestName' does not name a type
questmanager.h:284: error: 'THashMapQuestStartScript' does not name a type
BattleArena.cpp: In constructor 'CBattleArena::CBattleArena()':
BattleArena.cpp:13: error: class 'CBattleArena' does not have any field named 'm_pEvent'
BattleArena.cpp: At global scope:
BattleArena.cpp:87: error: 'LPEVENT' was not declared in this scope
BattleArena.cpp:87: error: expected primary-expression before 'long'
BattleArena.cpp:87: error: initializer expression list treated as compound expression
BattleArena.cpp:88: error: expected ',' or ';' before '{' token
Makefile:190: recipe for target '.obj/BattleArena.o' failed
gmake: *** [.obj/BattleArena.o] Error 1
root@:/usr/src/sursa_athora/game/src # clear
root@:/usr/src/sursa_athora/game/src # cd /usr
root@:/usr # rm -rf usr
root@:/usr # cd /usr/src/sursa_athora/game/src
root@:/usr/src/sursa_athora/game/src # gmake clean
root@:/usr/src/sursa_athora/game/src # gmake dep
Note: gcc autodepend is autodetected, so target dep skipped
root@:/usr/src/sursa_athora/game/src #
root@:/usr/src/sursa_athora/game/src # gmake
 [Endlles]         Compiling: BattleArena.cpp
In file included from BattleArena.cpp:1:
stdafx.h:16:38: error: cryptopp/cryptoppLibLink.h: No such file or directory
In file included from stdafx.h:44,
                 from BattleArena.cpp:1:
event.h:10:35: error: boost/intrusive_ptr.hpp: No such file or directory
In file included from BattleArena.cpp:7:
char.h:4:35: error: boost/unordered_map.hpp: No such file or directory
In file included from stdafx.h:44,
                 from BattleArena.cpp:1:
event.h:37: error: 'boost' has not been declared
event.h:37: error: expected initializer before '<' token
event.h:38: error: typedef 'TEVENTFUNC' is initialized (use __typeof__ instead)
event.h:38: error: 'LPEVENT' was not declared in this scope
event.h:38: error: expected primary-expression before 'long'
event.h:57: error: 'TEVENTFUNC' does not name a type
event.h: In constructor 'event::event()':
event.h:47: error: class 'event' does not have any field named 'func'
event.h: At global scope:
event.h:83: error: 'LPEVENT' does not name a type
event.h:84: error: variable or field 'event_cancel' declared void
event.h:84: error: 'LPEVENT' was not declared in this scope
event.h:84: error: expected primary-expression before ')' token
event.h:85: error: 'LPEVENT' was not declared in this scope
event.h:86: error: 'LPEVENT' was not declared in this scope
event.h:87: error: variable or field 'event_reset_time' declared void
event.h:87: error: 'LPEVENT' was not declared in this scope
event.h:87: error: expected primary-expression before 'long'
event.h:91: error: 'LPEVENT' was not declared in this scope
In file included from BattleArena.cpp:4:
BattleArena.h:21: error: 'LPEVENT' does not name a type
In file included from char.h:9,
                 from BattleArena.cpp:7:
horse_rider.h:92: error: 'LPEVENT' does not name a type
horse_rider.h:93: error: 'LPEVENT' does not name a type
horse_rider.h:95: error: 'LPEVENT' has not been declared
horse_rider.h:96: error: 'LPEVENT' has not been declared
In file included from char.h:15,
                 from BattleArena.cpp:7:
mining.h:6: error: 'LPEVENT' does not name a type
In file included from BattleArena.cpp:7:
char.h:518: error: 'boost' has not been declared
char.h:518: error: ISO C++ forbids declaration of 'unordered_map' with no type
char.h:518: error: expected ';' before '<' token
In file included from BattleArena.cpp:7:
char.h:1067: error: 'LPEVENT' has not been declared
char.h:1115: error: 'LPEVENT' does not name a type
char.h:1124: error: 'LPEVENT' was not declared in this scope
char.h:1124: error: template argument 2 is invalid
char.h:1124: error: template argument 4 is invalid
char.h:1563: error: 'LPEVENT' does not name a type
char.h:1592: error: 'boost' has not been declared
char.h:1592: error: ISO C++ forbids declaration of 'unordered_map' with no type
char.h:1592: error: expected ';' before '<' token
char.h:1854: error: 'LPEVENT' does not name a type
char.h:1855: error: 'LPEVENT' does not name a type
char.h:1856: error: 'LPEVENT' does not name a type
char.h:1857: error: 'LPEVENT' does not name a type
char.h:1858: error: 'LPEVENT' does not name a type
char.h:1859: error: 'LPEVENT' does not name a type
char.h:1860: error: 'LPEVENT' does not name a type
char.h:1861: error: 'LPEVENT' does not name a type
char.h:1863: error: 'LPEVENT' does not name a type
char.h:1865: error: 'LPEVENT' does not name a type
char.h:1866: error: 'LPEVENT' does not name a type
char.h:1871: error: 'LPEVENT' does not name a type
char.h:1873: error: 'LPEVENT' does not name a type
char.h:1874: error: 'LPEVENT' does not name a type
char.h:1875: error: 'LPEVENT' does not name a type
char.h:1876: error: 'LPEVENT' does not name a type
char.h:1888: error: 'LPEVENT' was not declared in this scope
char.h:1888: error: template argument 2 is invalid
char.h:1888: error: template argument 4 is invalid
char.h:2114: error: 'LPEVENT' does not name a type
char.h:2276: error: 'LPEVENT' does not name a type
char.h:2284: error: 'LPEVENT' does not name a type
char.h: In member function 'void CHARACTER::SetPartyRequestEvent(int)':
char.h:1067: error: 'm_pkPartyRequestEvent' was not declared in this scope
char.h: In member function 'bool CHARACTER::IsWarping() const':
char.h:1878: error: 'm_pkWarpEvent' was not declared in this scope
In file included from sectree_manager.h:4,
                 from BattleArena.cpp:8:
sectree.h: At global scope:
sectree.h:166: error: 'LPEVENT' has not been declared
In file included from regen.h:1,
                 from BattleArena.cpp:9:
dungeon.h:160: error: 'LPEVENT' does not name a type
dungeon.h:162: error: 'LPEVENT' does not name a type
dungeon.h:163: error: 'LPEVENT' does not name a type
dungeon.h:167: error: 'LPEVENT' has not been declared
dungeon.h:169: error: 'LPEVENT' has not been declared
dungeon.h:170: error: 'LPEVENT' has not been declared
In file included from BattleArena.cpp:9:
regen.h:31: error: 'LPEVENT' does not name a type
regen.h: In constructor 'regen::regen()':
regen.h:47: error: type 'event' is not a direct base of 'regen'
In file included from questnpc.h:4,
                 from questmanager.h:6,
                 from BattleArena.cpp:10:
questpc.h: At global scope:
questpc.h:107: error: 'LPEVENT' has not been declared
questpc.h:175: error: 'LPEVENT' was not declared in this scope
questpc.h:175: error: template argument 2 is invalid
questpc.h:175: error: template argument 4 is invalid
In file included from BattleArena.cpp:10:
questmanager.h:108: error: 'LPEVENT' has not been declared
questmanager.h:225: error: 'LPEVENT' was not declared in this scope
questmanager.h:225: error: template argument 2 is invalid
questmanager.h:225: error: template argument 4 is invalid
questmanager.h:280: error: 'boost' has not been declared
questmanager.h:280: error: ISO C++ forbids declaration of 'unordered_map' with no type
questmanager.h:280: error: typedef name may not be a nested-name-specifier
questmanager.h:280: error: expected ';' before '<' token
questmanager.h:281: error: 'boost' has not been declared
questmanager.h:281: error: ISO C++ forbids declaration of 'unordered_map' with no type
questmanager.h:281: error: typedef name may not be a nested-name-specifier
questmanager.h:281: error: expected ';' before '<' token
questmanager.h:283: error: 'THashMapQuestName' does not name a type
questmanager.h:284: error: 'THashMapQuestStartScript' does not name a type
BattleArena.cpp: In constructor 'CBattleArena::CBattleArena()':
BattleArena.cpp:13: error: class 'CBattleArena' does not have any field named 'm_pEvent'
BattleArena.cpp: At global scope:
BattleArena.cpp:87: error: 'LPEVENT' was not declared in this scope
BattleArena.cpp:87: error: expected primary-expression before 'long'
BattleArena.cpp:87: error: initializer expression list treated as compound expression
BattleArena.cpp:88: error: expected ',' or ';' before '{' token
Makefile:190: recipe for target '.obj/BattleArena.o' failed
gmake: *** [.obj/BattleArena.o] Error 1
Avatar utilizator
sorrellboss
Nivel 3

Nivel 3
Mesaje: 461
Membru din: 29 Iun 2014, 09:51
Server: Metin2Gorj
Regat: Shinsoo
Aprecieri: 45  
Mulţumiri: 4  
Medalii

up
Avatar utilizator
sorrellboss
Nivel 3

Nivel 3
Mesaje: 461
Membru din: 29 Iun 2014, 09:51
Server: Metin2Gorj
Regat: Shinsoo
Aprecieri: 45  
Mulţumiri: 4  
Medalii

Up

[ Postat de pe Android ] Imagine
Avatar utilizator
sorrellboss
Nivel 3

Nivel 3
Mesaje: 461
Membru din: 29 Iun 2014, 09:51
Server: Metin2Gorj
Regat: Shinsoo
Aprecieri: 45  
Mulţumiri: 4  
Medalii

Up

[ Postat de pe Android ] Imagine
Avatar utilizator
sorrellboss
Nivel 3

Nivel 3
Mesaje: 461
Membru din: 29 Iun 2014, 09:51
Server: Metin2Gorj
Regat: Shinsoo
Aprecieri: 45  
Mulţumiri: 4  
Medalii

up
Avatar utilizator
CjMt2
Nivel 2

Nivel 2
Mesaje: 291
Membru din: 20 Sep 2014, 07:01
Server: CjMt2
Regat: Shinsoo
Aprecieri: 18  
Mulţumiri: 22  
Discord: Copiază ID
 Contact:
Medalii

stdafx.h:16:38: error: cryptopp/cryptoppLibLink.h: No such file or directory
Ai directorul Extern, este accesibil? Are cryptopp?
Daca nu era freebsd open source si rain nu ar fi furat filele sursei de la ymir azi nu exista acest forum.
Afișează semnătura
Avatar utilizator
sorrellboss
Nivel 3

Nivel 3
Mesaje: 461
Membru din: 29 Iun 2014, 09:51
Server: Metin2Gorj
Regat: Shinsoo
Aprecieri: 45  
Mulţumiri: 4  
Medalii

nu il am.. unde ar trebuii sa il gasesc . ai putea sa mi l dai si mie te rog?
Avatar utilizator
Filipino
Metin Master

Metin Master
Mesaje: 2789
Membru din: 03 Sep 2014, 21:02
Server: ▬▬▬▬▬▬
Aprecieri: 39  
Mulţumiri: 785  
Discord: Copiază ID
Medalii

Dacă în 3 zile autorul subiectului nu va da niciun semn de viata în topic, subiectul va fi mutat în Arhivă Probleme şi Întrebări.
Imagine
Afișează semnătura
Închis
Răspunsuri
3
Vizualizări
164
Răspunsuri
1
Vizualizări
213
Răspunsuri
4
Vizualizări
243
Răspunsuri
9
Vizualizări
638

Înapoi la “Arhivă Probleme şi Întrebări”

  • Informaţie
  • Cine este conectat

    Utilizatori ce ce navighează pe acest forum: Niciun utilizator înregistrat și 76 vizitatori