Problema hyde costumes

Totalitatea subiectelor care nu respectă regulamentul impus in sectiunea "Probleme şi Întrebări" vor fi stocate aici.
Închis
Avatar utilizator
[Pablo]
Utilizator interzis !

Utilizator interzis !
Mesaje: 170
Membru din: 26 Mar 2020, 19:11
Server: In curand
Regat: Jinno
Aprecieri: 38  
Mulţumiri: 85  
Discord: Copiază ID
Medalii

*Problemă/Întrebare:
Tipologie server:
*Resursă folosită: Link exclusiv J4M
*ServerFiles utilizat:
*Eroarea: char.h:2226: error: expected unqualified-id before 'public'
char.h:2229: error: non-member function 'int GetHideCostume(int)' cannot have cv-qualifier
Poză:
*Detalii suplimentare: Platesc daca e nevoie
char.h
Avatar utilizator
Ionuţ M.
Metin Master

Metin Master
Mesaje: 2680
Membru din: 28 Noi 2015, 22:02
Aprecieri: 170  
Mulţumiri: 12723  
  Rezolvări prob.: 2
Discord: Copiază ID
 Contact:
Medalii

Adauga
#ifdef ENABLE_HIDE_COSTUME_SYSTEM
    public:
        void    FuncHideCostume(int slot);
        void    FuncHideCostumeLoad();
        int     GetHideCostume(int wear) const ;
        void    SetHideCostumeUpdate();
        int     GetSlotsCostume();
        int     GetSlotDefault(int slot);
#endif
deasupra la asta
};

ESex GET_SEX(LPCHARACTER ch);
adaugi sub transmutatie.
Imagine
Afișează semnătura
Avatar utilizator
[Pablo]
Utilizator interzis !

Utilizator interzis !
Mesaje: 170
Membru din: 26 Mar 2020, 19:11
Server: In curand
Regat: Jinno
Aprecieri: 38  
Mulţumiri: 85  
Discord: Copiază ID
Medalii

Ionuţ M. scrie: ↑18 Apr 2020, 14:07 Adauga
#ifdef ENABLE_HIDE_COSTUME_SYSTEM
    public:
        void    FuncHideCostume(int slot);
        void    FuncHideCostumeLoad();
        int     GetHideCostume(int wear) const ;
        void    SetHideCostumeUpdate();
        int     GetSlotsCostume();
        int     GetSlotDefault(int slot);
#endif
deasupra la asta
};

ESex GET_SEX(LPCHARACTER ch);
adaugi sub transmutatie.
Acum mi-a dat aceasta eroare
cmd.cpp:283: error: 'do_costume_hide' was not declared in this scope
cmd.cpp:283: error: expected primary-expression before 'ch'
cmd.cpp:283: error: expected primary-expression before 'const'
cmd.cpp:283: error: expected primary-expression before 'int'
cmd.cpp:283: error: expected primary-expression before 'int'
cmd.cpp:285: error: expected unqualified-id before '{' token
gmake: *** [.obj/cmd.o] Error 1

cmd
Avatar utilizator
Ionuţ M.
Metin Master

Metin Master
Mesaje: 2680
Membru din: 28 Noi 2015, 22:02
Aprecieri: 170  
Mulţumiri: 12723  
  Rezolvări prob.: 2
Discord: Copiază ID
 Contact:
Medalii

[Pablo] scrie: ↑18 Apr 2020, 14:15
Ionuţ M. scrie: ↑18 Apr 2020, 14:07 Adauga
#ifdef ENABLE_HIDE_COSTUME_SYSTEM
    public:
        void    FuncHideCostume(int slot);
        void    FuncHideCostumeLoad();
        int     GetHideCostume(int wear) const ;
        void    SetHideCostumeUpdate();
        int     GetSlotsCostume();
        int     GetSlotDefault(int slot);
#endif
deasupra la asta
};

ESex GET_SEX(LPCHARACTER ch);
adaugi sub transmutatie.
Acum mi-a dat aceasta eroare
cmd.cpp:283: error: 'do_costume_hide' was not declared in this scope
cmd.cpp:283: error: expected primary-expression before 'ch'
cmd.cpp:283: error: expected primary-expression before 'const'
cmd.cpp:283: error: expected primary-expression before 'int'
cmd.cpp:283: error: expected primary-expression before 'int'
cmd.cpp:285: error: expected unqualified-id before '{' token
gmake: *** [.obj/cmd.o] Error 1

cmd
{ "\n",     NULL,           0,          POS_DEAD,   GM_IMPLEMENTOR  }  /* 반드시 이 것이 마지막이어야 한다. */
Deasupra la asta adauga
#ifdef ENABLE_HIDE_COSTUME_SYSTEM
    { "costume_hide", do_costume_hide, 0, POS_DEAD, GM_PLAYER},
#endif 
Si sterge ce ai pus sub el ca nu e bine.
Deasupra la asta adauga
struct command_info cmd_info[] =
#ifdef ENABLE_HIDE_COSTUME_SYSTEM
    ACMD(do_costume_hide);
#endif
Imagine
Afișează semnătura
Avatar utilizator
[Pablo]
Utilizator interzis !

Utilizator interzis !
Mesaje: 170
Membru din: 26 Mar 2020, 19:11
Server: In curand
Regat: Jinno
Aprecieri: 38  
Mulţumiri: 85  
Discord: Copiază ID
Medalii

Ionuţ M. scrie: ↑18 Apr 2020, 14:23
[Pablo] scrie: ↑18 Apr 2020, 14:15
Ionuţ M. scrie: ↑18 Apr 2020, 14:07 Adauga
#ifdef ENABLE_HIDE_COSTUME_SYSTEM
    public:
        void    FuncHideCostume(int slot);
        void    FuncHideCostumeLoad();
        int     GetHideCostume(int wear) const ;
        void    SetHideCostumeUpdate();
        int     GetSlotsCostume();
        int     GetSlotDefault(int slot);
#endif
deasupra la asta
};

ESex GET_SEX(LPCHARACTER ch);
adaugi sub transmutatie.
Acum mi-a dat aceasta eroare
cmd.cpp:283: error: 'do_costume_hide' was not declared in this scope
cmd.cpp:283: error: expected primary-expression before 'ch'
cmd.cpp:283: error: expected primary-expression before 'const'
cmd.cpp:283: error: expected primary-expression before 'int'
cmd.cpp:283: error: expected primary-expression before 'int'
cmd.cpp:285: error: expected unqualified-id before '{' token
gmake: *** [.obj/cmd.o] Error 1

cmd
{ "\n",     NULL,           0,          POS_DEAD,   GM_IMPLEMENTOR  }  /* 반드시 이 것이 마지막이어야 한다. */
Deasupra la asta adauga
#ifdef ENABLE_HIDE_COSTUME_SYSTEM
    { "costume_hide", do_costume_hide, 0, POS_DEAD, GM_PLAYER},
#endif 
Si sterge ce ai pus sub el ca nu e bine.
Deasupra la asta adauga
struct command_info cmd_info[] =
#ifdef ENABLE_HIDE_COSTUME_SYSTEM
    ACMD(do_costume_hide);
#endif
Nu vreau sa fiu nesimtit dar mai am una ....

input_login.cpp: In member function 'void CInputLogin::Entergame(DESC*, const char*)':
input_login.cpp:668: error: name lookup of 'i' changed for new ISO 'for' scoping
input_login.cpp:663: error: using obsolete binding at 'i'
input_login.cpp:671: error: continue statement not within a loop
gmake: *** [.obj/input_login.o] Error 1
Avatar utilizator
Ionuţ M.
Metin Master

Metin Master
Mesaje: 2680
Membru din: 28 Noi 2015, 22:02
Aprecieri: 170  
Mulţumiri: 12723  
  Rezolvări prob.: 2
Discord: Copiază ID
 Contact:
Medalii

[Pablo] scrie: ↑18 Apr 2020, 14:28

Nu vreau sa fiu nesimtit dar mai am una ....

input_login.cpp: In member function 'void CInputLogin::Entergame(DESC*, const char*)':
input_login.cpp:668: error: name lookup of 'i' changed for new ISO 'for' scoping
input_login.cpp:663: error: using obsolete binding at 'i'
input_login.cpp:671: error: continue statement not within a loop
gmake: *** [.obj/input_login.o] Error 1

Incearca acum
Imagine
Afișează semnătura
Avatar utilizator
Ionuţ M.
Metin Master

Metin Master
Mesaje: 2680
Membru din: 28 Noi 2015, 22:02
Aprecieri: 170  
Mulţumiri: 12723  
  Rezolvări prob.: 2
Discord: Copiază ID
 Contact:
Medalii

Arhivat.
Imagine
Afișează semnătura
Închis
Răspunsuri
3
Vizualizări
219
Răspunsuri
1
Vizualizări
124
Răspunsuri
2
Vizualizări
378

Înapoi la “Arhivă Probleme şi Întrebări”

  • Informaţie
  • Cine este conectat

    Utilizatori ce ce navighează pe acest forum: Semrush [Bot] și 67 vizitatori