Tipologie server:
*Resursă folosită: Link exclusiv J4M
*ServerFiles utilizat:
*Eroarea: char.h
char.h
Poză:
*Detalii suplimentare: Platesc daca e nevoie
char.h


#ifdef ENABLE_HIDE_COSTUME_SYSTEM
public:
void FuncHideCostume(int slot);
void FuncHideCostumeLoad();
int GetHideCostume(int wear) const ;
void SetHideCostumeUpdate();
int GetSlotsCostume();
int GetSlotDefault(int slot);
#endif
deasupra la asta
Acum mi-a dat aceasta eroareIonuţ M. scrie: ↑18 Apr 2020, 14:07 Adauga#ifdef ENABLE_HIDE_COSTUME_SYSTEM public: void FuncHideCostume(int slot); void FuncHideCostumeLoad(); int GetHideCostume(int wear) const ; void SetHideCostumeUpdate(); int GetSlotsCostume(); int GetSlotDefault(int slot); #endifdeasupra la asta
};
ESex GET_SEX(LPCHARACTER ch);
adaugi sub transmutatie.

[Pablo] scrie: ↑18 Apr 2020, 14:15Acum mi-a dat aceasta eroareIonuţ M. scrie: ↑18 Apr 2020, 14:07 Adauga#ifdef ENABLE_HIDE_COSTUME_SYSTEM public: void FuncHideCostume(int slot); void FuncHideCostumeLoad(); int GetHideCostume(int wear) const ; void SetHideCostumeUpdate(); int GetSlotsCostume(); int GetSlotDefault(int slot); #endifdeasupra la asta
};
ESex GET_SEX(LPCHARACTER ch);
adaugi sub transmutatie.
cmd.cpp:283: error: 'do_costume_hide' was not declared in this scope
cmd.cpp:283: error: expected primary-expression before 'ch'
cmd.cpp:283: error: expected primary-expression before 'const'
cmd.cpp:283: error: expected primary-expression before 'int'
cmd.cpp:283: error: expected primary-expression before 'int'
cmd.cpp:285: error: expected unqualified-id before '{' token
gmake: *** [.obj/cmd.o] Error 1
cmd
{ "\n", NULL, 0, POS_DEAD, GM_IMPLEMENTOR } /* 반드시 이 것이 마지막이어야 한다. */
Deasupra la asta adauga
#ifdef ENABLE_HIDE_COSTUME_SYSTEM
{ "costume_hide", do_costume_hide, 0, POS_DEAD, GM_PLAYER},
#endif
Si sterge ce ai pus sub el ca nu e bine.struct command_info cmd_info[] =
#ifdef ENABLE_HIDE_COSTUME_SYSTEM
ACMD(do_costume_hide);
#endif

Nu vreau sa fiu nesimtit dar mai am una ....Ionuţ M. scrie: ↑18 Apr 2020, 14:23[Pablo] scrie: ↑18 Apr 2020, 14:15Acum mi-a dat aceasta eroareIonuţ M. scrie: ↑18 Apr 2020, 14:07 Adauga#ifdef ENABLE_HIDE_COSTUME_SYSTEM public: void FuncHideCostume(int slot); void FuncHideCostumeLoad(); int GetHideCostume(int wear) const ; void SetHideCostumeUpdate(); int GetSlotsCostume(); int GetSlotDefault(int slot); #endifdeasupra la asta
};
ESex GET_SEX(LPCHARACTER ch);
adaugi sub transmutatie.
cmd.cpp:283: error: 'do_costume_hide' was not declared in this scope
cmd.cpp:283: error: expected primary-expression before 'ch'
cmd.cpp:283: error: expected primary-expression before 'const'
cmd.cpp:283: error: expected primary-expression before 'int'
cmd.cpp:283: error: expected primary-expression before 'int'
cmd.cpp:285: error: expected unqualified-id before '{' token
gmake: *** [.obj/cmd.o] Error 1
cmd{ "\n", NULL, 0, POS_DEAD, GM_IMPLEMENTOR } /* 반드시 이 것이 마지막이어야 한다. */Deasupra la asta adauga#ifdef ENABLE_HIDE_COSTUME_SYSTEM { "costume_hide", do_costume_hide, 0, POS_DEAD, GM_PLAYER}, #endifSi sterge ce ai pus sub el ca nu e bine.
Deasupra la asta adaugastruct command_info cmd_info[] =#ifdef ENABLE_HIDE_COSTUME_SYSTEM ACMD(do_costume_hide); #endif

[Pablo] scrie: ↑18 Apr 2020, 14:28
Nu vreau sa fiu nesimtit dar mai am una ....
input_login.cpp: In member function 'void CInputLogin::Entergame(DESC*, const char*)':
input_login.cpp:668: error: name lookup of 'i' changed for new ISO 'for' scoping
input_login.cpp:663: error: using obsolete binding at 'i'
input_login.cpp:671: error: continue statement not within a loop
gmake: *** [.obj/input_login.o] Error 1
Incearca acum

Utilizatori ce ce navighează pe acest forum: Niciun utilizator înregistrat și 80 vizitatori