Tipologie server(PvM / PvP):PVM
*Resursă folosită:just4metin.ro/sursa/battlepass-t90417.html
*ServerFiles utilizat:
*Syserr:
Poză:
*Detalii suplimentare:
Am urmat toti pasii, atent , nu am gresit nimic in modificarea fisierelor.
Cod: Selectaţi tot
char_affect.cpp: In member function 'int CHARACTER::ProcessAffect()':
char_affect.cpp:267: error: 'GetBattlePassEndTime' was not declared in this scope
char_affect.cpp:272: error: 'm_dwBattlePassEndTime' was not declared in this scope
gmake: *** [OBJDIR/char_affect.o] Error 1
gmake: *** Waiting for unfinished jobs....
In file included from char_item.cpp:64:
battle_pass.h:37: error: 'TMapBattlePassReward' was not declared in this scope
battle_pass.h:37: error: '>>' should be '> >' within a nested template argument list
battle_pass.h:38: error: 'TMapBattleMissionInfo' was not declared in this scope
battle_pass.h:38: error: '>>' should be '> >' within a nested template argument list
char_item.cpp: In member function 'bool CHARACTER::UseItemEx(CItem*, TItemPos)':
char_item.cpp:3945: error: 'unique_ptr' is not a member of 'std'
char_item.cpp:3945: error: expected primary-expression before '>' token
char_item.cpp:3945: error: 'pmsg' was not declared in this scope
char_item.cpp:3953: error: 'GetSecondsTillNextMonth' was not declared in this scope
char_item.cpp:3968: error: 'm_dwBattlePassEndTime' was not declared in this scope
In file included from char_battle.cpp:65:
battle_pass.h:37: error: 'TMapBattlePassReward' was not declared in this scope
battle_pass.h:37: error: '>>' should be '> >' within a nested template argument list
battle_pass.h:38: error: 'TMapBattleMissionInfo' was not declared in this scope
battle_pass.h:38: error: '>>' should be '> >' within a nested template argument list
gmake: *** [OBJDIR/char_item.o] Error 1
gmake: *** [OBJDIR/char_battle.o] Error 1
char.cpp: In member function 'void CHARACTER::Initialize()':
char.cpp:535: error: 'm_dwBattlePassEndTime' was not declared in this scope
char.cpp: In member function 'void CHARACTER::CreatePlayerProto(TPlayerTable&)':
char.cpp:1503: error: 'm_dwBattlePassEndTime' was not declared in this scope
char.cpp: In member function 'void CHARACTER::SetPlayerProto(const TPlayerTable*)':
char.cpp:2429: error: 'm_dwBattlePassEndTime' was not declared in this scope
char.cpp: In member function 'void CHARACTER::UpdateMissionProgress(DWORD, DWORD, DWORD, DWORD, bool)':
char.cpp:10912: error: 'CBattlePass' has not been declared
char.cpp:10913: error: 'CBattlePass' has not been declared
char.cpp:10916: error: 'CBattlePass' has not been declared
char.cpp:10938: error: 'CBattlePass' has not been declared


