Eroare compilare sursa client

Totalitatea subiectelor care nu respectă regulamentul impus in sectiunea "Probleme şi Întrebări" vor fi stocate aici.
Închis
Avatar utilizator
kidcrock
Nou Venit

Nou Venit
Mesaje: 32
Membru din: 08 Apr 2020, 23:13
Regat: Jinno
Aprecieri: 13  
Mulţumiri: 1  
Medalii

*Problemă/Întrebare: Salut ma ajuta si pe mine cineva cu eroare asta primita la compilare sursa client ca nu gasesc nicio solutie multumesc
Tipologie server:...
*Resursă folosită:Ephelion2
*ServerFiles utilizat:Ephelion2
*Syserr:....
Poză:...
*Detalii suplimentare:
1>------ Build started: Project: CWebBrowser, Configuration: Release Win32 ------
2>------ Build started: Project: EffectLib, Configuration: Release Win32 ------
3>------ Build started: Project: EterBase, Configuration: Release Win32 ------
4>------ Build started: Project: EterGrnLib, Configuration: Release Win32 ------
1> CWebBrowser.c
3> StdAfx.cpp
2> StdAfx.cpp
4> StdAfx.cpp
3> cipher.cpp
4> LODController.cpp
2> EffectData.cpp
1> CWebBrowser.vcxproj -> D:\Selling_Resources\Sources\Client\extern\projects\CWebBrowser\Release\CWebBrowser.lib
5>------ Build started: Project: EterImageLib, Configuration: Release Win32 ------
4> Material.cpp
2> EffectElementBase.cpp
2> EffectElementBaseInstance.cpp
2> EffectInstance.cpp
5> StdAfx.cpp
4> Mesh.cpp
4> Model.cpp
2> EffectManager.cpp
4> ModelInstance.cpp
4> ModelInstanceCollisionDetection.cpp
5> DXTCImage.cpp
4> ModelInstanceModel.cpp
2> EffectMesh.cpp
4> ModelInstanceMotion.cpp
5> Image.cpp
5> TGAImage.cpp
4> ModelInstanceRender.cpp
3> CPostIt.cpp
4> ModelInstanceUpdate.cpp
4> Motion.cpp
4> Thing.cpp
2> EffectMeshInstance.cpp
5> EterImageLib.vcxproj -> D:\Selling_Resources\Sources\Client\extern\projects\EterImageLib\Release\EterImageLib.lib
4> ThingInstance.cpp
6>------ Build started: Project: EterLib, Configuration: Release Win32 ------
2> EffectUpdateDecorator.cpp
4> Util.cpp
3> CRC32.cpp
3> Debug.cpp
4> EterGrnLib.vcxproj -> D:\Selling_Resources\Sources\Client\extern\projects\EterGrnLib\Release\EterGrnLib.lib
7>------ Build started: Project: EterLocale, Configuration: Release Win32 ------
7> StdAfx.cpp
2> EmitterProperty.cpp
6> StdAfx.cpp
2> FrameController.cpp
2> ParticleInstance.cpp
2> ParticleProperty.cpp
2> ParticleSystemData.cpp
2> ParticleSystemInstance.cpp
3> error.cpp
7> Arabic.cpp
7> StringCodec.cpp
7> StringCodec_Vietnamese.cpp
3> FileBase.cpp
6> AttributeData.cpp
2> SimpleLightData.cpp
6> AttributeInstance.cpp
2> SimpleLightInstance.cpp
6> BlockTexture.cpp
2> Type.cpp
6> Camera.cpp
6> CollisionData.cpp
6> ColorTransitionHelper.cpp
6> CullingManager.cpp
6> Decal.cpp
6> EnvironmentMap.cpp
7> EterLocale.vcxproj -> D:\Selling_Resources\Sources\Client\extern\projects\EterLocale\Release\EterLocale.lib
6> DibBar.cpp
8>------ Build started: Project: EterPythonLib, Configuration: Release Win32 ------
6> FileLoaderThread.cpp
6> GrpBase.cpp
6> GrpCollisionObject.cpp
6> GrpColor.cpp
6> GrpColorInstance.cpp
6> GrpD3DXBuffer.cpp
3> FileDir.cpp
8> StdAfx.cpp
3> FileLoader.cpp
6> GrpDetector.cpp
6> GrpDevice.cpp
6> GrpDIB.cpp
6> GrpDummyFrameBuffer.cpp
3> Log.cpp
6> Compiling...
6> GrpExpandedImageInstance.cpp
8> PythonGraphic.cpp
6> GrpFontTexture.cpp
8> PythonGraphicImageModule.cpp
8> PythonGraphicModule.cpp
6> GrpImage.cpp
3> lzo.cpp
6> GrpImageInstance.cpp
8> PythonGraphicTextModule.cpp
6> GrpImageTexture.cpp
8> PythonGraphicThingModule.cpp
8> PythonGridSlotWindow.cpp
3> MappedFile.cpp
8> PythonSlotWindow.cpp
6> GrpIndexBuffer.cpp
6> GrpLightManager.cpp
8> PythonWindow.cpp
8> PythonWindowManager.cpp
6> GrpMarkInstance.cpp
6> GrpMath.cpp
8> PythonWindowManagerModule.cpp
6> GrpObjectInstance.cpp
3> Memory.cpp
6> GrpPixelShader.cpp
6> GrpRatioInstance.cpp
6> GrpRenderTargetTexture.cpp
6> GrpScreen.cpp
6> GrpShadowTexture.cpp
3>C:\Program Files (x86)\Microsoft SDKs\Windows\v7.1A\include\DbgHelp.h(1540): warning C4091: 'typedef ': ignored on left of '' when no variable is declared
3>C:\Program Files (x86)\Microsoft SDKs\Windows\v7.1A\include\DbgHelp.h(3056): warning C4091: 'typedef ': ignored on left of '' when no variable is declared
8> EterPythonLib.vcxproj -> D:\Selling_Resources\Sources\Client\extern\projects\EterPythonLib\Release\EterPythonLib.lib
3> Base.cpp
9>------ Build started: Project: GameLib, Configuration: Release Win32 ------
6> GrpSubImage.cpp
9> StdAfx.cpp
6> GrpText.cpp
6> GrpTextInstance.cpp
6> GrpTexture.cpp
3> Poly.cpp
6> GrpVertexBuffer.cpp
6> Compiling...
6> GrpVertexBufferDynamic.cpp
6> GrpVertexBufferStatic.cpp
6> GrpVertexShader.cpp
6> IME.cpp
6> Input.cpp
6> JpegFile.cpp
6> LensFlare.cpp
3> Symbol.cpp
6> lineintersect_utils.cpp
6> MSApplication.cpp
6> MSWindow.cpp
6> Mutex.cpp
6> NetAddress.cpp
9> ActorInstance.cpp
6> NetDatagram.cpp
3> SymTable.cpp
6> NetDatagramReceiver.cpp
6> NetDatagramSender.cpp
6> NetDevice.cpp
6> NetPacketHeaderMap.cpp
6> NetStream.cpp
6> parser.cpp
3> Random.cpp
6> PathStack.cpp
9> ActorInstanceAttach.cpp
6> Compiling...
6> ReferenceObject.cpp
6> Resource.cpp
3> Stl.cpp
9> ActorInstanceBattle.cpp
6> ResourceManager.cpp
3> tea.cpp
9> ActorInstanceBlend.cpp
6> ScreenFilter.cpp
6> SkyBox.cpp
3> TempFile.cpp
9> ActorInstanceCollisionDetection.cpp
6> StateManager.cpp
6> TargaResource.cpp
6> TextBar.cpp
6> TextFileLoader.cpp
6> TextTag.cpp
9> ActorInstanceData.cpp
3> Compiling...
3> Timer.cpp
6> Thread.cpp
6> Util.cpp
6>......\source\eterlib\Util.cpp(296): warning C4242: '=': conversion from 'int' to 'BYTE', possible loss of data
3> tinyxml2.cpp
9> ActorInstanceEvent.cpp
3> Utils.cpp
9> ActorInstanceFly.cpp
2> EffectLib.vcxproj -> D:\Selling_Resources\Sources\Client\extern\projects\EffectLib\Release\EffectLib.lib
10>------ Build started: Project: MilesLib, Configuration: Release Win32 ------
10> Stdafx.cpp
9> ActorInstanceMotion.cpp
10> SoundBase.cpp
9> ActorInstanceMotionEvent.cpp
3> EterBase.vcxproj -> D:\Selling_Resources\Sources\Client\extern\projects\EterBase\Release\EterBase.lib
11>------ Build started: Project: ScriptLib, Configuration: Release Win32 ------
10> SoundData.cpp
11> StdAfx.cpp
6> EterLib.vcxproj -> D:\Selling_Resources\Sources\Client\extern\projects\EterLib\Release\EterLib.lib
12>------ Build started: Project: SpeedTreeLib, Configuration: Release Win32 ------
9> ActorInstancePosition.cpp
12> StdAfx.cpp
10> SoundInstance2D.cpp
9> ActorInstanceRender.cpp
11> PythonDebugModule.cpp
11> PythonLauncher.cpp
10> SoundInstance3D.cpp
12> SpeedTreeForest.cpp
11> PythonMarshal.cpp
9> ActorInstanceRotation.cpp
11> PythonUtils.cpp
11> Resource.cpp
10> SoundInstanceStream.cpp
12> SpeedTreeForestDirectX8.cpp
9> ActorInstanceSync.cpp
10> SoundManager.cpp
12> SpeedTreeWrapper.cpp
12> SpeedTreeLib.vcxproj -> D:\Selling_Resources\Sources\Client\extern\projects\SpeedTreeLib\Release\SpeedTreeLib.lib
13>------ Build started: Project: SphereLib, Configuration: Release Win32 ------
11> ScriptLib.vcxproj -> D:\Selling_Resources\Sources\Client\extern\projects\ScriptLib\Release\ScriptLib.lib
14>------ Build started: Project: PRTerrainLib, Configuration: Release Win32 ------
10> SoundManager2D.cpp
14> StdAfx.cpp
10> SoundManager3D.cpp
10> SoundManagerStream.cpp
9> ActorInstanceWeaponTrace.cpp
13> StdAfx.cpp
9> Area.cpp
13> frustum.cpp
10> Type.cpp
13> sphere.cpp
13> spherepack.cpp
13> SphereLib.vcxproj -> D:\Selling_Resources\Sources\Client\extern\projects\SphereLib\Release\SphereLib.lib
15>------ Build started: Project: EterPack, Configuration: Release Win32 ------
14> Terrain.cpp
15> StdAfx.cpp
15> Archive.cpp
10> MilesLib.vcxproj -> D:\Selling_Resources\Sources\Client\extern\projects\MilesLib\Release\MilesLib.lib
16>------ Build started: Project: _Lz4ForFox, Configuration: Release Win32 ------
16>C:\Program Files (x86)\MSBuild\Microsoft.Cpp\v4.0\V140\Microsoft.CppBuild.targets(392,5): warning MSB8028: The intermediate directory (Release) contains files shared from another project (_LibLz4.vcxproj). This can lead to incorrect clean and rebuild behavior.
14>......\source\prterrainlib\Terrain.cpp(297): warning C4242: '=': conversion from 'int' to 'unsigned char', possible loss of data
14> TextureSet.cpp
16> lz4.c
16> lz4frame.c
16> lz4hc.c
16> xxhash.c
9> AreaLoaderThread.cpp
14> TerrainLib.vcxproj -> D:\Selling_Resources\Sources\Client\extern\projects\TerrainLib\Release\PRTerrainLib.lib
17>------ Build started: Project: EterCythonLib, Configuration: Release Win32 ------
15>d:\selling_resources\sources\client\source\eterpack\Archive.h(60): warning C4018: '<': signed/unsigned mismatch
16> _LibLz4.vcxproj -> D:\Selling_Resources\Sources\Client\extern\lib\for_fox\release_Lz4ForFox.lib
15> EterPack.cpp
17> The system cannot find the path specified.
15> EterPackManager.cpp
17>C:\Program Files (x86)\MSBuild\Microsoft.Cpp\v4.0\V140\Microsoft.CppCommon.targets(123,5): error MSB3073: The command "cd .........._CYTHONIZER__PackFiles
15> FileSystem.cpp
17>C:\Program Files (x86)\MSBuild\Microsoft.Cpp\v4.0\V140\Microsoft.CppCommon.targets(123,5): error MSB3073:
15>d:\selling_resources\sources\client\source\eterpack\Archive.h(60): warning C4018: '<': signed/unsigned mismatch
17>C:\Program Files (x86)\MSBuild\Microsoft.Cpp\v4.0\V140\Microsoft.CppCommon.targets(123,5): error MSB3073: C:\Python27\python conv/root_process.py cython
15> EterPack.vcxproj -> D:\Selling_Resources\Sources\Client\extern\projects\EterPack\Release\EterPack.lib
17>C:\Program Files (x86)\MSBuild\Microsoft.Cpp\v4.0\V140\Microsoft.CppCommon.targets(123,5): error MSB3073:
17>C:\Program Files (x86)\MSBuild\Microsoft.Cpp\v4.0\V140\Microsoft.CppCommon.targets(123,5): error MSB3073: :VCEnd" exited with code 3.
9> AreaTerrain.cpp
9> DungeonBlock.cpp
9> FlyingData.cpp
9> Compiling...
9> FlyingInstance.cpp
9> FlyingObjectManager.cpp
9> FlyTarget.cpp
9> FlyTrace.cpp
9> GameEventManager.cpp
9> GameType.cpp
9> GameUtil.cpp
9> ItemData.cpp
9> ItemManager.cpp
9> MapBase.cpp
9> MapManager.cpp
9>......\source\gamelib\MapManager.cpp(397): warning C4242: 'argument': conversion from 'int' to 'const BYTE', possible loss of data
9> MapOutdoor.cpp
9> MapOutdoorCharacterShadow.cpp
9> MapOutdoorIndexBuffer.cpp
9> MapOutdoorLoad.cpp
9> MapOutdoorQuadtree.cpp
9> MapOutdoorRender.cpp
9> MapOutdoorRenderHTP.cpp
9> MapOutdoorRenderSTP.cpp
9> MapOutdoorUpdate.cpp
9> Compiling...
9> MapOutdoorWater.cpp
9> MapType.cpp
9> MapUtil.cpp
9> PhysicsObject.cpp
9> Property.cpp
9> PropertyLoader.cpp
9> PropertyManager.cpp
9> RaceData.cpp
9> RaceDataFile.cpp
9> RaceManager.cpp
9>......\source\gamelib\RaceManager.cpp(343): warning C4242: 'argument': conversion from 'int' to 'BYTE', possible loss of data
9> RaceMotionData.cpp
9> SnowEnvironment.cpp
9> SnowParticle.cpp
9> TerrainDecal.cpp
9> TerrainPatch.cpp
9> TerrainQuadtree.cpp
9> WeaponTrace.cpp
9> GameLib.vcxproj -> D:\Selling_Resources\Sources\Client\extern\projects\GameLib\Release\GameLib.lib
18>------ Build started: Project: UserInterface, Configuration: Release Win32 ------
18>C:\Program Files (x86)\MSBuild\Microsoft.Cpp\v4.0\V140\Microsoft.CppBuild.targets(368,5): warning MSB8004: Output Directory does not end with a trailing slash. This build instance will add the slash as it is required to allow proper evaluation of the Output Directory.
18> StdAfx.cpp
18> AccountConnector.cpp
18> AffectFlagContainer.cpp
18> CameraProcedure.cpp
18> CCpuId.cpp
18> CHddData.cpp
18> CMacAddr.cpp
18> CMachineGuid.cpp
18> CNetworkAdapter.cpp
18> GameType.cpp
18> GuildMarkDownloader.cpp
18> GuildMarkUploader.cpp
18> HWIDManager.cpp
18> InstanceBase.cpp
18> InstanceBaseBattle.cpp
18> InstanceBaseEffect.cpp
18> InstanceBaseEvent.cpp
18> InstanceBaseMotion.cpp
18> InstanceBaseMovement.cpp
18> InstanceBaseTransform.cpp
18> InsultChecker.cpp
18> Compiling...
18> Locale.cpp
18> MarkImage.cpp
18> MarkManager.cpp
18> NetworkActorManager.cpp
18> ProcessCRC.cpp
18> ProcessScanner.cpp
18> PythonApplication.cpp
18> PythonApplicationCamera.cpp
18> PythonApplicationCursor.cpp
18> PythonApplicationEvent.cpp
18> PythonApplicationModule.cpp
18> PythonApplicationProcedure.cpp
18> PythonApplicationWebPage.cpp
18> PythonBackground.cpp
18> PythonBackgroundModule.cpp
18> PythonCharacterManager.cpp
18> PythonCharacterManagerModule.cpp
18> PythonCharacterModule.cpp
18> PythonChat.cpp
18> PythonChatModule.cpp
18> Compiling...
18> PythonEffectModule.cpp
18> PythonEventManager.cpp
18> PythonEventManagerMoudle.cpp
18> PythonExchange.cpp
18> PythonExchangeModule.cpp
18> PythonFlyModule.cpp
18> PythonGameEventManagerModule.cpp
18> PythonGuild.cpp
18> PythonIME.cpp
18> PythonIMEModule.cpp
18>......\source\userinterface\PythonIMEModule.cpp(163): warning C4242: 'argument': conversion from 'int' to 'wchar_t', possible loss of data
18> PythonItem.cpp
18> PythonItemModule.cpp
18> PythonMessenger.cpp
18> PythonMiniMap.cpp
18> PythonMiniMapModule.cpp
18> PythonNetworkStream.cpp
18> PythonNetworkStreamCommand.cpp
18> PythonNetworkStreamEvent.cpp
18> PythonNetworkStreamModule.cpp
18>......\source\userinterface\PythonNetworkStreamModule.cpp(703): warning C4242: 'argument': conversion from 'int' to 'unsigned char', possible loss of data
18> PythonNetworkStreamPhaseGame.cpp
18>......\source\userinterface\PythonNetworkStreamPhaseGame.cpp(1172): warning C4242: '=': conversion from 'UINT' to 'unsigned char', possible loss of data
18> Compiling...
18> PythonNetworkStreamPhaseGameActor.cpp
18> PythonNetworkStreamPhaseGameItem.cpp
18>......\source\userinterface\PythonNetworkStreamPhaseGameItem.cpp(1113): warning C4242: '=': conversion from 'int32_t' to 'WORD', possible loss of data
18> PythonNetworkStreamPhaseHandShake.cpp
18> PythonNetworkStreamPhaseLoading.cpp
18> PythonNetworkStreamPhaseLogin.cpp
18> PythonNetworkStreamPhaseOffline.cpp
18> PythonNetworkStreamPhaseSelect.cpp
18> PythonNonPlayer.cpp
18> PythonNonPlayerModule.cpp
18> PythonPackModule.cpp
18> PythonPlayer.cpp
18> PythonPlayerEventHandler.cpp
18> PythonPlayerInput.cpp
18> PythonPlayerInputKeyboard.cpp
18> PythonPlayerInputMouse.cpp
18> PythonPlayerModule.cpp
18>......\source\userinterface\PythonPlayerModule.cpp(1049): warning C4242: 'argument': conversion from 'int' to 'WORD', possible loss of data
18> PythonPlayerSkill.cpp
18>......\source\userinterface\PythonPlayerSkill.cpp(1019): warning C4242: 'argument': conversion from 'int' to 'WORD', possible loss of data
18> PythonPrivateShopSearch.cpp
18> PythonProfilerModule.cpp
18> PythonQuest.cpp
18> Compiling...
18> PythonrootlibManager.cpp
18> PythonSafeBox.cpp
18> PythonSash.cpp
18> PythonShop.cpp
18>......\source\userinterface\PythonShop.cpp(417): warning C4242: 'argument': conversion from 'int' to 'unsigned char', possible loss of data
18> PythonSkill.cpp
18>......\source\userinterface\PythonSkill.cpp(182): warning C4242: '=': conversion from 'int' to 'unsigned char', possible loss of data
18> PythonSkillPet.cpp
18> PythonSoundManagerModule.cpp
18> PythonSystem.cpp
18>......\source\userinterface\PythonSystem.cpp(656): warning C4473: 'fprintf' : not enough arguments passed for format string
18> ......\source\userinterface\PythonSystem.cpp(656): note: placeholders and their parameters expect 15 variadic arguments, but 14 were provided
18> ......\source\userinterface\PythonSystem.cpp(656): note: the missing variadic argument 15 is required by format string '%d'
18> PythonSystemModule.cpp
18> PythonTextTail.cpp
18> PythonTextTailModule.cpp
18> PythonWhisper.cpp
18> ServerStateChecker.cpp
18> ServerStateCheckerModule.cpp
18> UserInterface.cpp
18>......\source\userinterface\UserInterface.cpp(457): warning C4102: 'Clean': unreferenced label
18> Creating library ..........\Ephelion2\Ephelion2 - Starter.lib and object ..........\Ephelion2\Ephelion2 - Starter.exp
18>LIBCMT.lib(initializers.obj) : warning LNK4098: defaultlib 'msvcrt.lib' conflicts with use of other libs; use /NODEFAULTLIB:library
18> Generating code
18> Finished generating code
18>jpeg.lib(jerror.obj) : warning LNK4049: locally defined symbol _exit imported
18>jpeg.lib(jerror.obj) : warning LNK4049: locally defined symbol ___acrt_iob_func imported
18>jpeg.lib(jerror.obj) : warning LNK4049: locally defined symbol ___stdio_common_vfprintf imported
18>jpeg.lib(jerror.obj) : warning LNK4049: locally defined symbol ___stdio_common_vsprintf imported
18>jpeg.lib(jdatasrc.obj) : warning LNK4049: locally defined symbol _fread imported
18>jpeg.lib(jmemmgr.obj) : warning LNK4049: locally defined symbol _getenv imported
18>jpeg.lib(jmemmgr.obj) : warning LNK4049: locally defined symbol ___stdio_common_vsscanf imported
18>jpeg.lib(jdmarker.obj) : warning LNK4049: locally defined symbol _strncpy imported
18>jpeg.lib(jmemnobs.obj) : warning LNK4049: locally defined symbol _free imported
18>jpeg.lib(jmemnobs.obj) : warning LNK4049: locally defined symbol _malloc imported
18> UserInterface.vcxproj -> D:\Selling_Resources\Sources\Client\extern\projects\UserInterface..........\Ephelion2\Ephelion2 - Starter.exe
========== Build: 17 succeeded, 1 failed, 0 up-to-date, 0 skipped ==========
Avatar utilizator
Dex
Nivel 3

Nivel 3
Mesaje: 397
Membru din: 07 Mai 2020, 14:32
Regat: Shinsoo
Aprecieri: 137  
Mulţumiri: 486  
Discord: Copiază ID
Medalii

Cum ar fi daca ai posta Log-ul din Error si nu din Output, ca sa vedem exact und este problema?
Imagine
Afișează semnătura
Avatar utilizator
Stresso
Nou Venit

Nou Venit
Mesaje: 9
Membru din: 18 Aug 2018, 22:53
Server: ...
Regat: Jinno
Aprecieri: 18  
Mulţumiri: 1  
Medalii

xDex scrie: ↑07 Mai 2020, 15:00 Cum ar fi daca ai posta Log-ul din Error si nu din Output, ca sa vedem exact und este problema?
scuze boss primesc dar nu m-am uitat bine uite iti las print
ht tps://imgur.com/fthNJE3
ht tps://imgur.com/Wh2XP7f
Avatar utilizator
Kazuhiri
Nivel 9

Nivel 9
Mesaje: 2088
Membru din: 26 Mar 2017, 19:14
Server: Demetris
Regat: Shinsoo
Aprecieri: 396  
Mulţumiri: 3227  
  Rezolvări prob.: 2
Discord: Copiază ID
Medalii

arhivat,inactiv de 5 zile+
Demetris2 Imagine
Afișează semnătura
Închis
Răspunsuri
3
Vizualizări
185
Răspunsuri
5
Vizualizări
458
Răspunsuri
4
Vizualizări
213
Răspunsuri
3
Vizualizări
229

Înapoi la “Arhivă Probleme şi Întrebări”

  • Informaţie