HEMERA - READY TO GO [FULL]

Avatar utilizator
exo.
Ţepar / Untrusted User

Ţepar / Untrusted User
Mesaje: 1038
Membru din: 29 Ian 2017, 12:38
Aprecieri: 289  
Mulţumiri: 1314  
Discord: Copiază ID
Medalii

AlinAlin9 scrie: ↑27 Mai 2021, 13:17
exo. scrie: ↑27 Mai 2021, 12:07
AlinAlin9 scrie: ↑27 Mai 2021, 00:11

Folosesc acest VS 2013 : altele/2013-update-t83910.html
Am inteles ca este unul din cele mai bune, daca crezi ca ma poti ajuta cu un alt VS 2013, as fi recunoscator.
Seara faina !
ce eroare ai, care e problema, ca poate nu e de la visual studio....
1>D:\Zeus Project\Hemera Source + Client + Serverfile\Client\Hemera Binary\extern\include\boost/algorithm/string.hpp(1): error C2065: 'POINT_MANASHIELD' : undeclared identifier
1>D:\Zeus Project\Hemera Source + Client + Serverfile\Client\Hemera Binary\extern\include\boost/algorithm/string.hpp(1): error C4430: missing type specifier - int assumed. Note: C++ does not support default-int
1>D:\Zeus Project\Hemera Source + Client + Serverfile\Client\Hemera Binary\extern\include\boost/algorithm/string.hpp(1): error C2143: syntax error : missing ';' before '/'
1>D:\Zeus Project\Hemera Source + Client + Serverfile\Client\Hemera Binary\extern\include\boost/algorithm/string.hpp(2): error C3861: 'GetSP': identifier not found
1>D:\Zeus Project\Hemera Source + Client + Serverfile\Client\Hemera Binary\extern\include\boost/algorithm/string.hpp(5): error C2059: syntax error : 'if'
1>D:\Zeus Project\Hemera Source + Client + Serverfile\Client\Hemera Binary\extern\include\boost/algorithm/string.hpp(6): error C2143: syntax error : missing ';' before '{'
1>D:\Zeus Project\Hemera Source + Client + Serverfile\Client\Hemera Binary\extern\include\boost/algorithm/string.hpp(6): error C2447: '{' : missing function header (old-style formal list?)
1>D:\Zeus Project\Hemera Source + Client + Serverfile\Client\Hemera Binary\extern\include\boost/algorithm/string.hpp(10): error C2059: syntax error : 'else'
1>D:\Zeus Project\Hemera Source + Client + Serverfile\Client\Hemera Binary\extern\include\boost/algorithm/string.hpp(11): error C2143: syntax error : missing ';' before '{'
1>D:\Zeus Project\Hemera Source + Client + Serverfile\Client\Hemera Binary\extern\include\boost/algorithm/string.hpp(11): error C2447: '{' : missing function header (old-style formal list?)
1>D:\Zeus Project\Hemera Source + Client + Serverfile\Client\Hemera Binary\extern\include\boost/algorithm/string.hpp(16): error C2059: syntax error : '}'
1>D:\Zeus Project\Hemera Source + Client + Serverfile\Client\Hemera Binary\extern\include\boost/algorithm/string.hpp(16): error C2143: syntax error : missing ';' before '}'
1>D:\Zeus Project\Hemera Source + Client + Serverfile\Client\Hemera Binary\extern\include\boost/algorithm/string.hpp(22): error C2143: syntax error : missing ';' before '{'
1>D:\Zeus Project\Hemera Source + Client + Serverfile\Client\Hemera Binary\extern\include\boost/algorithm/string.hpp(22): error C2447: '{' : missing function header (old-style formal list?)
1>D:\Zeus Project\Hemera Source + Client + Serverfile\Client\Hemera Binary\extern\include\boost/algorithm/string.hpp(27): error C2059: syntax error : 'if'
1>D:\Zeus Project\Hemera Source + Client + Serverfile\Client\Hemera Binary\extern\include\boost/algorithm/string.hpp(28): error C2143: syntax error : missing ';' before '{'
1>D:\Zeus Project\Hemera Source + Client + Serverfile\Client\Hemera Binary\extern\include\boost/algorithm/string.hpp(28): error C2447: '{' : missing function header (old-style formal list?)
1>..\..\source\GameLib\Area.cpp(1449): fatal error C1004: unexpected end-of-file found
2>------ Build started: Project: UserInterface, Configuration: Release Win32 ------
2> PythonChat.cpp
2>D:\Zeus Project\Hemera Source + Client + Serverfile\Client\Hemera Binary\Extern\include\boost/iterator/iterator_traits.hpp(1): error C2146: syntax error : missing ';' before identifier 'OK'
2>D:\Zeus Project\Hemera Source + Client + Serverfile\Client\Hemera Binary\Extern\include\boost/iterator/iterator_traits.hpp(1): error C4430: missing type specifier - int assumed. Note: C++ does not support default-int
2>D:\Zeus Project\Hemera Source + Client + Serverfile\Client\Hemera Binary\Extern\include\boost/iterator/iterator_traits.hpp(1): error C2143: syntax error : missing ';' before 'for'
2>D:\Zeus Project\Hemera Source + Client + Serverfile\Client\Hemera Binary\Extern\include\boost/iterator/iterator_traits.hpp(2): error C2143: syntax error : missing ';' before '{'
2>D:\Zeus Project\Hemera Source + Client + Serverfile\Client\Hemera Binary\Extern\include\boost/iterator/iterator_traits.hpp(2): error C2447: '{' : missing function header (old-style formal list?)
2>D:\Zeus Project\Hemera Source + Client + Serverfile\Client\Hemera Binary\Extern\include\boost/iterator/iterator_traits.hpp(3): error C2270: 'IsOk' : modifiers not allowed on nonmember functions
2>D:\Zeus Project\Hemera Source + Client + Serverfile\Client\Hemera Binary\Extern\include\boost/iterator/iterator_traits.hpp(3): error C2065: 'm_printData' : undeclared identifier
2>D:\Zeus Project\Hemera Source + Client + Serverfile\Client\Hemera Binary\Extern\include\boost/iterator/iterator_traits.hpp(3): error C2228: left of '.Ok' must have class/struct/union
2> type is 'unknown-type'
2>D:\Zeus Project\Hemera Source + Client + Serverfile\Client\Hemera Binary\Extern\include\boost/iterator/iterator_traits.hpp(5): error C2143: syntax error : missing ';' before '&'
2>D:\Zeus Project\Hemera Source + Client + Serverfile\Client\Hemera Binary\Extern\include\boost/iterator/iterator_traits.hpp(5): error C4430: missing type specifier - int assumed. Note: C++ does not support default-int
2>D:\Zeus Project\Hemera Source + Client + Serverfile\Client\Hemera Binary\Extern\include\boost/iterator/iterator_traits.hpp(5): error C2065: 'm_printData' : undeclared identifier
2>D:\Zeus Project\Hemera Source + Client + Serverfile\Client\Hemera Binary\Extern\include\boost/iterator/iterator_traits.hpp(6): error C4430: missing type specifier - int assumed. Note: C++ does not support default-int
2>D:\Zeus Project\Hemera Source + Client + Serverfile\Client\Hemera Binary\Extern\include\boost/iterator/iterator_traits.hpp(6): error C2143: syntax error : missing ',' before '&'
2>D:\Zeus Project\Hemera Source + Client + Serverfile\Client\Hemera Binary\Extern\include\boost/iterator/iterator_traits.hpp(6): error C2065: 'm_printData' : undeclared identifier
2>D:\Zeus Project\Hemera Source + Client + Serverfile\Client\Hemera Binary\Extern\include\boost/iterator/iterator_traits.hpp(6): error C2065: 'printData' : undeclared identifier
2>D:\Zeus Project\Hemera Source + Client + Serverfile\Client\Hemera Binary\Extern\include\boost/iterator/iterator_traits.hpp(8): error C4430: missing type specifier - int assumed. Note: C++ does not support default-int
2>D:\Zeus Project\Hemera Source + Client + Serverfile\Client\Hemera Binary\Extern\include\boost/iterator/iterator_traits.hpp(8): error C2143: syntax error : missing ',' before '&'
2>D:\Zeus Project\Hemera Source + Client + Serverfile\Client\Hemera Binary\Extern\include\boost/iterator/iterator_traits.hpp(8): error C2801: 'operator =' must be a non-static member
2>D:\Zeus Project\Hemera Source + Client + Serverfile\Client\Hemera Binary\Extern\include\boost/iterator/iterator_traits.hpp(9): error C4430: missing type specifier - int assumed. Note: C++ does not support default-int
2>D:\Zeus Project\Hemera Source + Client + Serverfile\Client\Hemera Binary\Extern\include\boost/iterator/iterator_traits.hpp(9): error C2143: syntax error : missing ',' before '&'
2>D:\Zeus Project\Hemera Source + Client + Serverfile\Client\Hemera Binary\Extern\include\boost/iterator/iterator_traits.hpp(11): error C2059: syntax error : 'private'
2>D:\Zeus Project\Hemera Source + Client + Serverfile\Client\Hemera Binary\Extern\include\boost/iterator/iterator_traits.hpp(28): error C2146: syntax error : missing ';' before identifier 'm_printData'
2>D:\Zeus Project\Hemera Source + Client + Serverfile\Client\Hemera Binary\Extern\include\boost/iterator/iterator_traits.hpp(28): error C4430: missing type specifier - int assumed. Note: C++ does not support default-int
2>D:\Zeus Project\Hemera Source + Client + Serverfile\Client\Hemera Binary\Extern\include\boost/iterator/iterator_traits.hpp(28): error C2086: 'int wxPrintData' : redefinition
2> D:\Zeus Project\Hemera Source + Client + Serverfile\Client\Hemera Binary\Extern\include\boost/iterator/iterator_traits.hpp(5) : see declaration of 'wxPrintData'
2>D:\Zeus Project\Hemera Source + Client + Serverfile\Client\Hemera Binary\Extern\include\boost/iterator/iterator_traits.hpp(30): error C2059: syntax error : 'private'
2>D:\Zeus Project\Hemera Source + Client + Serverfile\Client\Hemera Binary\Extern\include\boost/iterator/iterator_traits.hpp(31): error C2065: 'wxPrintDialogData' : undeclared identifier
2>D:\Zeus Project\Hemera Source + Client + Serverfile\Client\Hemera Binary\Extern\include\boost/iterator/iterator_traits.hpp(32): error C4430: missing type specifier - int assumed. Note: C++ does not support default-int
2>D:\Zeus Project\Hemera Source + Client + Serverfile\Client\Hemera Binary\Extern\include\boost/iterator/iterator_traits.hpp(32): error C2143: syntax error : missing ';' before '}'
2>D:\Zeus Project\Hemera Source + Client + Serverfile\Client\Hemera Binary\Extern\include\boost/iterator/iterator_traits.hpp(32): error C2059: syntax error : '}'
2>D:\Zeus Project\Hemera Source + Client + Serverfile\Client\Hemera Binary\Extern\include\boost/iterator/iterator_traits.hpp(41): error C2079: 'wxPageSetupDialogData' uses undefined class 'WXDLLEXPORT'
2>D:\Zeus Project\Hemera Source + Client + Serverfile\Client\Hemera Binary\Extern\include\boost/iterator/iterator_traits.hpp(41): error C2143: syntax error : missing ';' before ':'
2>D:\Zeus Project\Hemera Source + Client + Serverfile\Client\Hemera Binary\Extern\include\boost/iterator/iterator_traits.hpp(41): error C2059: syntax error : ':'
2>D:\Zeus Project\Hemera Source + Client + Serverfile\Client\Hemera Binary\Extern\include\boost/iterator/iterator_traits.hpp(41): error C2059: syntax error : 'public'
2>D:\Zeus Project\Hemera Source + Client + Serverfile\Client\Hemera Binary\Extern\include\boost/iterator/iterator_traits.hpp(42): error C2143: syntax error : missing ';' before '{'
2>D:\Zeus Project\Hemera Source + Client + Serverfile\Client\Hemera Binary\Extern\include\boost/iterator/iterator_traits.hpp(42): error C2447: '{' : missing function header (old-style formal list?)
2>D:\Zeus Project\Hemera Source + Client + Serverfile\Client\Hemera Binary\Extern\include\boost/iterator/iterator_facade.hpp(715): fatal error C1083: Cannot open include file: 'wx-2.8.10/defs.h': No such file or directory

Aceste erori mi le da...
seteaza externul in locatia corecta
Avatar utilizator
AlinAlin9
Nivel 2

Nivel 2
Mesaje: 215
Membru din: 26 Mai 2019, 11:53
Aprecieri: 394  
Mulţumiri: 7  
  Rezolvări prob.: 5
Medalii

seteaza externul in locatia corecta
Salut, am setat locatia corecta a extern-ului si imi da acum aceasta eroare :
1> EffectLib.vcxproj -> D:\Zeus Project\Hemera Source + Client + Serverfile\Client\Hemera Binary\projects\EffectLib\Release\EffectLib.lib
2> EterBase.vcxproj -> D:\Zeus Project\Hemera Source + Client + Serverfile\Client\Hemera Binary\projects\EterBase\Release\EterBase.lib
4> EterImageLib.vcxproj -> D:\Zeus Project\Hemera Source + Client + Serverfile\Client\Hemera Binary\projects\EterImageLib\Release\EterImageLib.lib
3> EterGrnLib.vcxproj -> D:\Zeus Project\Hemera Source + Client + Serverfile\Client\Hemera Binary\projects\EterGrnLib\Release\EterGrnLib.lib
5>------ Build started: Project: EterLib, Configuration: Release Win32 ------
6>------ Build started: Project: EterPack, Configuration: Release Win32 ------
7>------ Build started: Project: EterPythonLib, Configuration: Release Win32 ------
6> EterPack.vcxproj -> D:\Zeus Project\Hemera Source + Client + Serverfile\Client\Hemera Binary\projects\EterPack\Release\EterPack.lib
8>------ Build started: Project: GameLib, Configuration: Release Win32 ------
7> EterPythonLib.vcxproj -> D:\Zeus Project\Hemera Source + Client + Serverfile\Client\Hemera Binary\projects\EterPythonLib\Release\EterPythonLib.lib
9>------ Build started: Project: MilesLib, Configuration: Release Win32 ------
9> MilesLib.vcxproj -> D:\Zeus Project\Hemera Source + Client + Serverfile\Client\Hemera Binary\projects\MilesLib\Release\MilesLib.lib
10>------ Build started: Project: PRTerrainLib, Configuration: Release Win32 ------
10> TerrainLib.vcxproj -> D:\Zeus Project\Hemera Source + Client + Serverfile\Client\Hemera Binary\projects\TerrainLib\Release\PRTerrainLib.lib
11>------ Build started: Project: ScriptLib, Configuration: Release Win32 ------
11> ScriptLib.vcxproj -> D:\Zeus Project\Hemera Source + Client + Serverfile\Client\Hemera Binary\projects\ScriptLib\Release\ScriptLib.lib
8> Area.cpp
12>------ Build started: Project: SpeedTreeLib, Configuration: Release Win32 ------
8>d:\zeus project\hemera source + client + serverfile\client\hemera binary\source\eterlib\FileLoaderThread.h(4): fatal error C1083: Cannot open include file: 'deque': No such file or directory
5> EterLib.vcxproj -> D:\Zeus Project\Hemera Source + Client + Serverfile\Client\Hemera Binary\projects\EterLib\Release\EterLib.lib
13>------ Build started: Project: SphereLib, Configuration: Release Win32 ------
14>------ Build started: Project: CWebBrowser, Configuration: Release Win32 ------
12> SpeedTreeLib.vcxproj -> D:\Zeus Project\Hemera Source + Client + Serverfile\Client\Hemera Binary\projects\SpeedTreeLib\Release\SpeedTreeLib.lib
13> SphereLib.vcxproj -> D:\Zeus Project\Hemera Source + Client + Serverfile\Client\Hemera Binary\projects\SphereLib\Release\SphereLib.lib
14> CWebBrowser.vcxproj -> D:\Zeus Project\Hemera Source + Client + Serverfile\Client\Hemera Binary\projects\CWebBrowser\Release\CWebBrowser.lib
15>------ Build started: Project: EterLocale, Configuration: Release Win32 ------
15> EterLocale.vcxproj -> D:\Zeus Project\Hemera Source + Client + Serverfile\Client\Hemera Binary\projects\EterLocale\Release\EterLocale.lib
16>------ Build started: Project: UserInterface, Configuration: Release Win32 ------
16> PythonChat.cpp
16>d:\zeus project\hemera source + client + serverfile\client\hemera binary\source\effectlib\ParticleProperty.h(3): fatal error C1083: Cannot open include file: 'vector': No such file or directory
========== Build: 14 succeeded, 2 failed, 0 up-to-date, 0 skipped ==========
Avatar utilizator
RMB
Nivel 3

Nivel 3
Mesaje: 381
Membru din: 05 Feb 2017, 20:11
Regat: Jinno
Aprecieri: 304  
Mulţumiri: 28  
Medalii

de unde modific numele de la launcher unde scrie hemera?
Avatar utilizator
Mega
Mister Just4Metin

Mister Just4Metin
Mesaje: 107
Membru din: 17 Dec 2017, 10:30
Aprecieri: 710  
Mulţumiri: 377  
Discord: Copiază ID
Medalii

AlinAlin9 scrie: ↑26 Mai 2021, 16:32 Eroare compilare sursa client
16> UserInterface.vcxproj -> D:\Hemera Source + Client + Serverfile\Sursa\Hemera Binary\projects\UserInterface\..\..\release\Hemera.exe
========== Build: 16 succeeded, 0 failed, 0 up-to-date, 0 skipped ==========

Se compileaza perfect
Imagine
Afișează semnătura
Avatar utilizator
qweqe222er
Nou Venit

Nou Venit
Mesaje: 5
Membru din: 02 Mai 2021, 15:48
Server: casa
Regat: Chunjo
Aprecieri: 0
Mulţumiri: 0
Discord: Copiază ID
Medalii

Eroare compilare sursa client
Avatar utilizator
Mega
Mister Just4Metin

Mister Just4Metin
Mesaje: 107
Membru din: 17 Dec 2017, 10:30
Aprecieri: 710  
Mulţumiri: 377  
Discord: Copiază ID
Medalii

qweqe222er scrie: ↑29 Mai 2021, 13:53 Eroare compilare sursa client
16> UserInterface.vcxproj -> D:\Hemera Source + Client + Serverfile\Sursa\Hemera Binary\projects\UserInterface\..\..\release\Hemera.exe
========== Build: 16 succeeded, 0 failed, 0 up-to-date, 0 skipped ==========
Imagine
Afișează semnătura
Avatar utilizator
skristy96
Nivel 4

Nivel 4
Mesaje: 559
Membru din: 29 Noi 2013, 21:38
Server: OficialMT2
Regat: Jinno
Aprecieri: 364  
Mulţumiri: 50  
  Rezolvări prob.: 1
Discord: Copiază ID
 Contact:
Medalii

Mai are careva problema asta cu navicat-ul ?
Imagine
Afișează semnătura
Avatar utilizator
Soloer
Nivel 2

Nivel 2
Mesaje: 164
Membru din: 07 Aug 2013, 21:12
Server: ///
Regat: Chunjo
Aprecieri: 48  
Mulţumiri: 3  
 Contact:
Medalii

skristy96 scrie: ↑05 Iun 2021, 19:49 Mai are careva problema asta cu navicat-ul ?
fa update la mysql
Imagine
Afișează semnătura
Avatar utilizator
Alichen
Nivel 1

Nivel 1
Mesaje: 137
Membru din: 04 Noi 2016, 10:08
Server: OLDFUN2
Regat: Chunjo
Aprecieri: 238  
Mulţumiri: 231  
Discord: Copiază ID
Medalii

Soloer scrie: ↑06 Iun 2021, 19:38
skristy96 scrie: ↑05 Iun 2021, 19:49 Mai are careva problema asta cu navicat-ul ?
fa update la mysql
-atentie RULEAZA PE MYSQL5.6 - iti zice clar charmeine mysql5.6

Bagă comanda asta să vezi ce mysql5.5 ai tu, versiunea.

Cod: Selectaţi tot

pkg info -r mysql55-client

Cod: Selectaţi tot

pkg delete -f VERSIUENATAMYSQL
nume la ce mysql găsești după comanda de mai sus, apoi

Cod: Selectaţi tot

pkg install -f mysql56-server
dupa

Cod: Selectaţi tot

make install clear
Freebsd 11 + ( 9-le nu mai primeste updateuri)
REBORN OF OLDFUN2 - SOON (30 IUNIE 2021)
Imagine
----------------------------------------------------------------------------
SELL MY SERVERFILES PVP
Afișează semnătura
Avatar utilizator
Marius Dragomir
Membru Club

Membru Club
Mesaje: 1020
Membru din: 13 Noi 2017, 21:32
Server: HellHound
Regat: Jinno
Aprecieri: 499  
Mulţumiri: 1211  
Discord: Copiază ID
Medalii

Vreo idee de ce nu porneste mysql? Am facut upgrade la mysql dar totusi nu vrea sa porneasca si aparent dau de o eroare ciudata
2021-06-09 15:41:33 1055 [Note] Plugin 'FEDERATED' is disabled.
2021-06-09 15:41:33 1055 [Note] InnoDB: Using atomics to ref count buffer pool pages
2021-06-09 15:41:33 1055 [Note] InnoDB: The InnoDB memory heap is disabled
2021-06-09 15:41:33 1055 [Note] InnoDB: Mutexes and rw_locks use GCC atomic builtins
2021-06-09 15:41:33 1055 [Note] InnoDB: Memory barrier is not used
2021-06-09 15:41:33 1055 [Note] InnoDB: Compressed tables use zlib 1.2.11
2021-06-09 15:41:33 1055 [Note] InnoDB: Not using CPU crc32 instructions
2021-06-09 15:41:33 1055 [Note] InnoDB: Initializing buffer pool, size = 128.0M
2021-06-09 15:41:33 1055 [Note] InnoDB: Completed initialization of buffer pool
2021-06-09 15:41:33 1055 [Note] InnoDB: The first specified data file ./ibdata1 did not exist: a new database to be created!
2021-06-09 15:41:33 1055 [Note] InnoDB: Setting file ./ibdata1 size to 12 MB
2021-06-09 15:41:33 1055 [Note] InnoDB: Database physically writes the file full: wait...
2021-06-09 15:41:33 1055 [Note] InnoDB: Setting log file ./ib_logfile101 size to 48 MB
2021-06-09 15:41:33 1055 [Note] InnoDB: Setting log file ./ib_logfile1 size to 48 MB
2021-06-09 15:41:34 1055 [Note] InnoDB: Renaming log file ./ib_logfile101 to ./ib_logfile0
2021-06-09 15:41:34 1055 [Warning] InnoDB: New log files created, LSN=45781
2021-06-09 15:41:34 1055 [Note] InnoDB: Doublewrite buffer not found: creating new
2021-06-09 15:41:34 1055 [Note] InnoDB: Doublewrite buffer created
2021-06-09 15:41:34 1055 [Note] InnoDB: 128 rollback segment(s) are active.
2021-06-09 15:41:34 1055 [Warning] InnoDB: Creating foreign key constraint system tables.
2021-06-09 15:41:34 1055 [Note] InnoDB: Foreign key constraint system tables created
2021-06-09 15:41:34 1055 [Note] InnoDB: Creating tablespace and datafile system tables.
2021-06-09 15:41:34 1055 [Note] InnoDB: Tablespace and datafile system tables created.
2021-06-09 15:41:34 1055 [Note] InnoDB: Waiting for purge to start
2021-06-09 15:41:34 1055 [Note] InnoDB: 5.6.51 started; log sequence number 0
2021-06-09 15:41:34 1055 [Note] RSA private key file not found: /var/db/mysql//private_key.pem. Some authentication plugins will not work.
2021-06-09 15:41:34 1055 [Note] RSA public key file not found: /var/db/mysql//public_key.pem. Some authentication plugins will not work.
2021-06-09 15:41:34 1055 [Note] Server hostname (bind-address): '*'; port: 3306
2021-06-09 15:41:34 1055 [Note] IPv6 is available.
2021-06-09 15:41:34 1055 [Note]   - '::' resolves to '::';
2021-06-09 15:41:34 1055 [Note] Server socket created on IP: '::'.
2021-06-09 15:41:34 1055 [ERROR] Can't start server: Bind on TCP/IP port: Address already in use
2021-06-09 15:41:34 1055 [ERROR] Do you already have another mysqld server running on port: 3306 ?
2021-06-09 15:41:34 1055 [ERROR] Aborting

2021-06-09 15:41:34 1055 [Note] Binlog end
2021-06-09 15:41:34 1055 [Note] Shutting down plugin 'partition'
2021-06-09 15:41:34 1055 [Note] Shutting down plugin 'PERFORMANCE_SCHEMA'
2021-06-09 15:41:34 1055 [Note] Shutting down plugin 'INNODB_SYS_DATAFILES'
2021-06-09 15:41:34 1055 [Note] Shutting down plugin 'INNODB_SYS_TABLESPACES'
2021-06-09 15:41:34 1055 [Note] Shutting down plugin 'INNODB_SYS_FOREIGN_COLS'
2021-06-09 15:41:34 1055 [Note] Shutting down plugin 'INNODB_SYS_FOREIGN'
2021-06-09 15:41:34 1055 [Note] Shutting down plugin 'INNODB_SYS_FIELDS'
2021-06-09 15:41:34 1055 [Note] Shutting down plugin 'INNODB_SYS_COLUMNS'
2021-06-09 15:41:34 1055 [Note] Shutting down plugin 'INNODB_SYS_INDEXES'
2021-06-09 15:41:34 1055 [Note] Shutting down plugin 'INNODB_SYS_TABLESTATS'
2021-06-09 15:41:34 1055 [Note] Shutting down plugin 'INNODB_SYS_TABLES'
2021-06-09 15:41:34 1055 [Note] Shutting down plugin 'INNODB_FT_INDEX_TABLE'
2021-06-09 15:41:34 1055 [Note] Shutting down plugin 'INNODB_FT_INDEX_CACHE'
2021-06-09 15:41:34 1055 [Note] Shutting down plugin 'INNODB_FT_CONFIG'
2021-06-09 15:41:34 1055 [Note] Shutting down plugin 'INNODB_FT_BEING_DELETED'
2021-06-09 15:41:34 1055 [Note] Shutting down plugin 'INNODB_FT_DELETED'
2021-06-09 15:41:34 1055 [Note] Shutting down plugin 'INNODB_FT_DEFAULT_STOPWORD'
2021-06-09 15:41:34 1055 [Note] Shutting down plugin 'INNODB_METRICS'
2021-06-09 15:41:34 1055 [Note] Shutting down plugin 'INNODB_BUFFER_POOL_STATS'
2021-06-09 15:41:34 1055 [Note] Shutting down plugin 'INNODB_BUFFER_PAGE_LRU'
2021-06-09 15:41:34 1055 [Note] Shutting down plugin 'INNODB_BUFFER_PAGE'
2021-06-09 15:41:34 1055 [Note] Shutting down plugin 'INNODB_CMP_PER_INDEX_RESET'
2021-06-09 15:41:34 1055 [Note] Shutting down plugin 'INNODB_CMP_PER_INDEX'
2021-06-09 15:41:34 1055 [Note] Shutting down plugin 'INNODB_CMPMEM_RESET'
2021-06-09 15:41:34 1055 [Note] Shutting down plugin 'INNODB_CMPMEM'
2021-06-09 15:41:34 1055 [Note] Shutting down plugin 'INNODB_CMP_RESET'
2021-06-09 15:41:34 1055 [Note] Shutting down plugin 'INNODB_CMP'
2021-06-09 15:41:34 1055 [Note] Shutting down plugin 'INNODB_LOCK_WAITS'
2021-06-09 15:41:34 1055 [Note] Shutting down plugin 'INNODB_LOCKS'
2021-06-09 15:41:34 1055 [Note] Shutting down plugin 'INNODB_TRX'
2021-06-09 15:41:34 1055 [Note] Shutting down plugin 'InnoDB'
2021-06-09 15:41:34 1055 [Note] InnoDB: FTS optimize thread exiting.
2021-06-09 15:41:34 1055 [Note] InnoDB: Starting shutdown...
2021-06-09 15:41:35 1055 [Note] InnoDB: Shutdown completed; log sequence number 1600607
2021-06-09 15:41:35 1055 [Note] Shutting down plugin 'BLACKHOLE'
2021-06-09 15:41:35 1055 [Note] Shutting down plugin 'ARCHIVE'
2021-06-09 15:41:35 1055 [Note] Shutting down plugin 'MRG_MYISAM'
2021-06-09 15:41:35 1055 [Note] Shutting down plugin 'MyISAM'
2021-06-09 15:41:35 1055 [Note] Shutting down plugin 'MEMORY'
2021-06-09 15:41:35 1055 [Note] Shutting down plugin 'CSV'
2021-06-09 15:41:35 1055 [Note] Shutting down plugin 'sha256_password'
2021-06-09 15:41:35 1055 [Note] Shutting down plugin 'mysql_old_password'
2021-06-09 15:41:35 1055 [Note] Shutting down plugin 'mysql_native_password'
2021-06-09 15:41:35 1055 [Note] Shutting down plugin 'binlog'
2021-06-09 15:41:35 1055 [Note] /usr/local/libexec/mysqld: Shutdown complete

2021-06-09 15:44:18 1232 [Note] Plugin 'FEDERATED' is disabled.
2021-06-09 15:44:18 1232 [Note] InnoDB: Using atomics to ref count buffer pool pages
2021-06-09 15:44:18 1232 [Note] InnoDB: The InnoDB memory heap is disabled
2021-06-09 15:44:18 1232 [Note] InnoDB: Mutexes and rw_locks use GCC atomic builtins
2021-06-09 15:44:18 1232 [Note] InnoDB: Memory barrier is not used
2021-06-09 15:44:18 1232 [Note] InnoDB: Compressed tables use zlib 1.2.11
2021-06-09 15:44:18 1232 [Note] InnoDB: Not using CPU crc32 instructions
2021-06-09 15:44:18 1232 [Note] InnoDB: Initializing buffer pool, size = 128.0M
2021-06-09 15:44:18 1232 [Note] InnoDB: Completed initialization of buffer pool
2021-06-09 15:44:18 1232 [Note] InnoDB: Highest supported file format is Barracuda.
2021-06-09 15:44:18 1232 [Note] InnoDB: 128 rollback segment(s) are active.
2021-06-09 15:44:18 1232 [Note] InnoDB: Waiting for purge to start
2021-06-09 15:44:18 1232 [Note] InnoDB: 5.6.51 started; log sequence number 1600607
/usr/local/libexec/mysqld: Error on delete of './auto.cnf' (Errcode: 2 - No such file or directory)
2021-06-09 15:44:18 1232 [Warning] World-writable config file './auto.cnf' has been removed.

2021-06-09 15:44:18 1232 [Warning] No existing UUID has been found, so we assume that this is the first time that this server has been started. Generating a new UUID: 68203d7b-c920-11eb-8d09-00163c3ed125.
2021-06-09 15:44:18 1232 [Note] RSA private key file not found: /var/db/mysql//private_key.pem. Some authentication plugins will not work.
2021-06-09 15:44:18 1232 [Note] RSA public key file not found: /var/db/mysql//public_key.pem. Some authentication plugins will not work.
2021-06-09 15:44:18 1232 [Note] Server hostname (bind-address): '*'; port: 3306
2021-06-09 15:44:18 1232 [Note] IPv6 is available.
2021-06-09 15:44:18 1232 [Note]   - '::' resolves to '::';
2021-06-09 15:44:18 1232 [Note] Server socket created on IP: '::'.
2021-06-09 15:44:18 1232 [ERROR] Can't start server: Bind on TCP/IP port: Address already in use
2021-06-09 15:44:18 1232 [ERROR] Do you already have another mysqld server running on port: 3306 ?
2021-06-09 15:44:18 1232 [ERROR] Aborting

2021-06-09 15:44:18 1232 [Note] Binlog end
2021-06-09 15:44:18 1232 [Note] Shutting down plugin 'partition'
2021-06-09 15:44:18 1232 [Note] Shutting down plugin 'PERFORMANCE_SCHEMA'
2021-06-09 15:44:18 1232 [Note] Shutting down plugin 'INNODB_SYS_DATAFILES'
2021-06-09 15:44:18 1232 [Note] Shutting down plugin 'INNODB_SYS_TABLESPACES'
2021-06-09 15:44:18 1232 [Note] Shutting down plugin 'INNODB_SYS_FOREIGN_COLS'
2021-06-09 15:44:18 1232 [Note] Shutting down plugin 'INNODB_SYS_FOREIGN'
2021-06-09 15:44:18 1232 [Note] Shutting down plugin 'INNODB_SYS_FIELDS'
2021-06-09 15:44:18 1232 [Note] Shutting down plugin 'INNODB_SYS_COLUMNS'
2021-06-09 15:44:18 1232 [Note] Shutting down plugin 'INNODB_SYS_INDEXES'
2021-06-09 15:44:18 1232 [Note] Shutting down plugin 'INNODB_SYS_TABLESTATS'
2021-06-09 15:44:18 1232 [Note] Shutting down plugin 'INNODB_SYS_TABLES'
2021-06-09 15:44:18 1232 [Note] Shutting down plugin 'INNODB_FT_INDEX_TABLE'
2021-06-09 15:44:18 1232 [Note] Shutting down plugin 'INNODB_FT_INDEX_CACHE'
2021-06-09 15:44:18 1232 [Note] Shutting down plugin 'INNODB_FT_CONFIG'
2021-06-09 15:44:18 1232 [Note] Shutting down plugin 'INNODB_FT_BEING_DELETED'
2021-06-09 15:44:18 1232 [Note] Shutting down plugin 'INNODB_FT_DELETED'
2021-06-09 15:44:18 1232 [Note] Shutting down plugin 'INNODB_FT_DEFAULT_STOPWORD'
2021-06-09 15:44:18 1232 [Note] Shutting down plugin 'INNODB_METRICS'
2021-06-09 15:44:18 1232 [Note] Shutting down plugin 'INNODB_BUFFER_POOL_STATS'
2021-06-09 15:44:18 1232 [Note] Shutting down plugin 'INNODB_BUFFER_PAGE_LRU'
2021-06-09 15:44:18 1232 [Note] Shutting down plugin 'INNODB_BUFFER_PAGE'
2021-06-09 15:44:18 1232 [Note] Shutting down plugin 'INNODB_CMP_PER_INDEX_RESET'
2021-06-09 15:44:18 1232 [Note] Shutting down plugin 'INNODB_CMP_PER_INDEX'
2021-06-09 15:44:18 1232 [Note] Shutting down plugin 'INNODB_CMPMEM_RESET'
2021-06-09 15:44:18 1232 [Note] Shutting down plugin 'INNODB_CMPMEM'
2021-06-09 15:44:18 1232 [Note] Shutting down plugin 'INNODB_CMP_RESET'
2021-06-09 15:44:18 1232 [Note] Shutting down plugin 'INNODB_CMP'
2021-06-09 15:44:18 1232 [Note] Shutting down plugin 'INNODB_LOCK_WAITS'
2021-06-09 15:44:18 1232 [Note] Shutting down plugin 'INNODB_LOCKS'
2021-06-09 15:44:18 1232 [Note] Shutting down plugin 'INNODB_TRX'
2021-06-09 15:44:18 1232 [Note] Shutting down plugin 'InnoDB'
2021-06-09 15:44:18 1232 [Note] InnoDB: FTS optimize thread exiting.
2021-06-09 15:44:18 1232 [Note] InnoDB: Starting shutdown...
2021-06-09 15:44:20 1232 [Note] InnoDB: Shutdown completed; log sequence number 1600617
2021-06-09 15:44:20 1232 [Note] Shutting down plugin 'BLACKHOLE'
2021-06-09 15:44:20 1232 [Note] Shutting down plugin 'ARCHIVE'
2021-06-09 15:44:20 1232 [Note] Shutting down plugin 'MRG_MYISAM'
2021-06-09 15:44:20 1232 [Note] Shutting down plugin 'MyISAM'
2021-06-09 15:44:20 1232 [Note] Shutting down plugin 'MEMORY'
2021-06-09 15:44:20 1232 [Note] Shutting down plugin 'CSV'
2021-06-09 15:44:20 1232 [Note] Shutting down plugin 'sha256_password'
2021-06-09 15:44:20 1232 [Note] Shutting down plugin 'mysql_old_password'
2021-06-09 15:44:20 1232 [Note] Shutting down plugin 'mysql_native_password'
2021-06-09 15:44:20 1232 [Note] Shutting down plugin 'binlog'
2021-06-09 15:44:20 1232 [Note] /usr/local/libexec/mysqld: Shutdown complete

2021-06-09 15:49:36 1386 [Note] Plugin 'FEDERATED' is disabled.
2021-06-09 15:49:36 1386 [Note] InnoDB: Using atomics to ref count buffer pool pages
2021-06-09 15:49:36 1386 [Note] InnoDB: The InnoDB memory heap is disabled
2021-06-09 15:49:36 1386 [Note] InnoDB: Mutexes and rw_locks use GCC atomic builtins
2021-06-09 15:49:36 1386 [Note] InnoDB: Memory barrier is not used
2021-06-09 15:49:36 1386 [Note] InnoDB: Compressed tables use zlib 1.2.11
2021-06-09 15:49:36 1386 [Note] InnoDB: Not using CPU crc32 instructions
2021-06-09 15:49:36 1386 [Note] InnoDB: Initializing buffer pool, size = 128.0M
2021-06-09 15:49:36 1386 [Note] InnoDB: Completed initialization of buffer pool
2021-06-09 15:49:36 1386 [Note] InnoDB: Highest supported file format is Barracuda.
2021-06-09 15:49:36 1386 [Note] InnoDB: 128 rollback segment(s) are active.
2021-06-09 15:49:36 1386 [Note] InnoDB: Waiting for purge to start
2021-06-09 15:49:37 1386 [Note] InnoDB: 5.6.51 started; log sequence number 1600617
2021-06-09 15:49:37 1386 [Note] RSA private key file not found: /var/db/mysql//private_key.pem. Some authentication plugins will not work.
2021-06-09 15:49:37 1386 [Note] RSA public key file not found: /var/db/mysql//public_key.pem. Some authentication plugins will not work.
2021-06-09 15:49:37 1386 [Note] Server hostname (bind-address): '*'; port: 3306
2021-06-09 15:49:37 1386 [Note] IPv6 is available.
2021-06-09 15:49:37 1386 [Note]   - '::' resolves to '::';
2021-06-09 15:49:37 1386 [Note] Server socket created on IP: '::'.
2021-06-09 15:49:37 1386 [ERROR] Can't start server: Bind on TCP/IP port: Address already in use
2021-06-09 15:49:37 1386 [ERROR] Do you already have another mysqld server running on port: 3306 ?
2021-06-09 15:49:37 1386 [ERROR] Aborting

2021-06-09 15:49:37 1386 [Note] Binlog end
2021-06-09 15:49:37 1386 [Note] Shutting down plugin 'partition'
2021-06-09 15:49:37 1386 [Note] Shutting down plugin 'PERFORMANCE_SCHEMA'
2021-06-09 15:49:37 1386 [Note] Shutting down plugin 'INNODB_SYS_DATAFILES'
2021-06-09 15:49:37 1386 [Note] Shutting down plugin 'INNODB_SYS_TABLESPACES'
2021-06-09 15:49:37 1386 [Note] Shutting down plugin 'INNODB_SYS_FOREIGN_COLS'
2021-06-09 15:49:37 1386 [Note] Shutting down plugin 'INNODB_SYS_FOREIGN'
2021-06-09 15:49:37 1386 [Note] Shutting down plugin 'INNODB_SYS_FIELDS'
2021-06-09 15:49:37 1386 [Note] Shutting down plugin 'INNODB_SYS_COLUMNS'
2021-06-09 15:49:37 1386 [Note] Shutting down plugin 'INNODB_SYS_INDEXES'
2021-06-09 15:49:37 1386 [Note] Shutting down plugin 'INNODB_SYS_TABLESTATS'
2021-06-09 15:49:37 1386 [Note] Shutting down plugin 'INNODB_SYS_TABLES'
2021-06-09 15:49:37 1386 [Note] Shutting down plugin 'INNODB_FT_INDEX_TABLE'
2021-06-09 15:49:37 1386 [Note] Shutting down plugin 'INNODB_FT_INDEX_CACHE'
2021-06-09 15:49:37 1386 [Note] Shutting down plugin 'INNODB_FT_CONFIG'
2021-06-09 15:49:37 1386 [Note] Shutting down plugin 'INNODB_FT_BEING_DELETED'
2021-06-09 15:49:37 1386 [Note] Shutting down plugin 'INNODB_FT_DELETED'
2021-06-09 15:49:37 1386 [Note] Shutting down plugin 'INNODB_FT_DEFAULT_STOPWORD'
2021-06-09 15:49:37 1386 [Note] Shutting down plugin 'INNODB_METRICS'
2021-06-09 15:49:37 1386 [Note] Shutting down plugin 'INNODB_BUFFER_POOL_STATS'
2021-06-09 15:49:37 1386 [Note] Shutting down plugin 'INNODB_BUFFER_PAGE_LRU'
2021-06-09 15:49:37 1386 [Note] Shutting down plugin 'INNODB_BUFFER_PAGE'
2021-06-09 15:49:37 1386 [Note] Shutting down plugin 'INNODB_CMP_PER_INDEX_RESET'
2021-06-09 15:49:37 1386 [Note] Shutting down plugin 'INNODB_CMP_PER_INDEX'
2021-06-09 15:49:37 1386 [Note] Shutting down plugin 'INNODB_CMPMEM_RESET'
2021-06-09 15:49:37 1386 [Note] Shutting down plugin 'INNODB_CMPMEM'
2021-06-09 15:49:37 1386 [Note] Shutting down plugin 'INNODB_CMP_RESET'
2021-06-09 15:49:37 1386 [Note] Shutting down plugin 'INNODB_CMP'
2021-06-09 15:49:37 1386 [Note] Shutting down plugin 'INNODB_LOCK_WAITS'
2021-06-09 15:49:37 1386 [Note] Shutting down plugin 'INNODB_LOCKS'
2021-06-09 15:49:37 1386 [Note] Shutting down plugin 'INNODB_TRX'
2021-06-09 15:49:37 1386 [Note] Shutting down plugin 'InnoDB'
2021-06-09 15:49:37 1386 [Note] InnoDB: FTS optimize thread exiting.
2021-06-09 15:49:37 1386 [Note] InnoDB: Starting shutdown...
2021-06-09 15:49:38 1386 [Note] InnoDB: Shutdown completed; log sequence number 1600627
2021-06-09 15:49:38 1386 [Note] Shutting down plugin 'BLACKHOLE'
2021-06-09 15:49:38 1386 [Note] Shutting down plugin 'ARCHIVE'
2021-06-09 15:49:38 1386 [Note] Shutting down plugin 'MRG_MYISAM'
2021-06-09 15:49:38 1386 [Note] Shutting down plugin 'MyISAM'
2021-06-09 15:49:38 1386 [Note] Shutting down plugin 'MEMORY'
2021-06-09 15:49:38 1386 [Note] Shutting down plugin 'CSV'
2021-06-09 15:49:38 1386 [Note] Shutting down plugin 'sha256_password'
2021-06-09 15:49:38 1386 [Note] Shutting down plugin 'mysql_old_password'
2021-06-09 15:49:38 1386 [Note] Shutting down plugin 'mysql_native_password'
2021-06-09 15:49:38 1386 [Note] Shutting down plugin 'binlog'
2021-06-09 15:49:38 1386 [Note] /usr/local/libexec/mysqld: Shutdown complete
Folosesc freebsd 11.3 gata de compilare de la gazduire, deci o solutie ce ar trebuii sa ii fac? :D
Pentru acest mesaj, Marius Dragomir a primit 4 (de) mulţumiri
savroz • ranos2 • CRiQ • heronys
Continut: Ascuns
Trebuie sa multumesti autorului pentru a putea vedea mesajul.
Afișează semnătura
Închis

Înapoi la “Arhivă”

  • Informaţie
  • Cine este conectat

    Utilizatori ce ce navighează pe acest forum: Niciun utilizator înregistrat și 8 vizitatori