seteaza externul in locatia corectaAlinAlin9 scrie: ↑27 Mai 2021, 13:17exo. scrie: ↑27 Mai 2021, 12:07ce eroare ai, care e problema, ca poate nu e de la visual studio....AlinAlin9 scrie: ↑27 Mai 2021, 00:11
Folosesc acest VS 2013 : altele/2013-update-t83910.html
Am inteles ca este unul din cele mai bune, daca crezi ca ma poti ajuta cu un alt VS 2013, as fi recunoscator.
Seara faina !1>D:\Zeus Project\Hemera Source + Client + Serverfile\Client\Hemera Binary\extern\include\boost/algorithm/string.hpp(1): error C2065: 'POINT_MANASHIELD' : undeclared identifier
1>D:\Zeus Project\Hemera Source + Client + Serverfile\Client\Hemera Binary\extern\include\boost/algorithm/string.hpp(1): error C4430: missing type specifier - int assumed. Note: C++ does not support default-int
1>D:\Zeus Project\Hemera Source + Client + Serverfile\Client\Hemera Binary\extern\include\boost/algorithm/string.hpp(1): error C2143: syntax error : missing ';' before '/'
1>D:\Zeus Project\Hemera Source + Client + Serverfile\Client\Hemera Binary\extern\include\boost/algorithm/string.hpp(2): error C3861: 'GetSP': identifier not found
1>D:\Zeus Project\Hemera Source + Client + Serverfile\Client\Hemera Binary\extern\include\boost/algorithm/string.hpp(5): error C2059: syntax error : 'if'
1>D:\Zeus Project\Hemera Source + Client + Serverfile\Client\Hemera Binary\extern\include\boost/algorithm/string.hpp(6): error C2143: syntax error : missing ';' before '{'
1>D:\Zeus Project\Hemera Source + Client + Serverfile\Client\Hemera Binary\extern\include\boost/algorithm/string.hpp(6): error C2447: '{' : missing function header (old-style formal list?)
1>D:\Zeus Project\Hemera Source + Client + Serverfile\Client\Hemera Binary\extern\include\boost/algorithm/string.hpp(10): error C2059: syntax error : 'else'
1>D:\Zeus Project\Hemera Source + Client + Serverfile\Client\Hemera Binary\extern\include\boost/algorithm/string.hpp(11): error C2143: syntax error : missing ';' before '{'
1>D:\Zeus Project\Hemera Source + Client + Serverfile\Client\Hemera Binary\extern\include\boost/algorithm/string.hpp(11): error C2447: '{' : missing function header (old-style formal list?)
1>D:\Zeus Project\Hemera Source + Client + Serverfile\Client\Hemera Binary\extern\include\boost/algorithm/string.hpp(16): error C2059: syntax error : '}'
1>D:\Zeus Project\Hemera Source + Client + Serverfile\Client\Hemera Binary\extern\include\boost/algorithm/string.hpp(16): error C2143: syntax error : missing ';' before '}'
1>D:\Zeus Project\Hemera Source + Client + Serverfile\Client\Hemera Binary\extern\include\boost/algorithm/string.hpp(22): error C2143: syntax error : missing ';' before '{'
1>D:\Zeus Project\Hemera Source + Client + Serverfile\Client\Hemera Binary\extern\include\boost/algorithm/string.hpp(22): error C2447: '{' : missing function header (old-style formal list?)
1>D:\Zeus Project\Hemera Source + Client + Serverfile\Client\Hemera Binary\extern\include\boost/algorithm/string.hpp(27): error C2059: syntax error : 'if'
1>D:\Zeus Project\Hemera Source + Client + Serverfile\Client\Hemera Binary\extern\include\boost/algorithm/string.hpp(28): error C2143: syntax error : missing ';' before '{'
1>D:\Zeus Project\Hemera Source + Client + Serverfile\Client\Hemera Binary\extern\include\boost/algorithm/string.hpp(28): error C2447: '{' : missing function header (old-style formal list?)
1>..\..\source\GameLib\Area.cpp(1449): fatal error C1004: unexpected end-of-file found
2>------ Build started: Project: UserInterface, Configuration: Release Win32 ------
2> PythonChat.cpp
2>D:\Zeus Project\Hemera Source + Client + Serverfile\Client\Hemera Binary\Extern\include\boost/iterator/iterator_traits.hpp(1): error C2146: syntax error : missing ';' before identifier 'OK'
2>D:\Zeus Project\Hemera Source + Client + Serverfile\Client\Hemera Binary\Extern\include\boost/iterator/iterator_traits.hpp(1): error C4430: missing type specifier - int assumed. Note: C++ does not support default-int
2>D:\Zeus Project\Hemera Source + Client + Serverfile\Client\Hemera Binary\Extern\include\boost/iterator/iterator_traits.hpp(1): error C2143: syntax error : missing ';' before 'for'
2>D:\Zeus Project\Hemera Source + Client + Serverfile\Client\Hemera Binary\Extern\include\boost/iterator/iterator_traits.hpp(2): error C2143: syntax error : missing ';' before '{'
2>D:\Zeus Project\Hemera Source + Client + Serverfile\Client\Hemera Binary\Extern\include\boost/iterator/iterator_traits.hpp(2): error C2447: '{' : missing function header (old-style formal list?)
2>D:\Zeus Project\Hemera Source + Client + Serverfile\Client\Hemera Binary\Extern\include\boost/iterator/iterator_traits.hpp(3): error C2270: 'IsOk' : modifiers not allowed on nonmember functions
2>D:\Zeus Project\Hemera Source + Client + Serverfile\Client\Hemera Binary\Extern\include\boost/iterator/iterator_traits.hpp(3): error C2065: 'm_printData' : undeclared identifier
2>D:\Zeus Project\Hemera Source + Client + Serverfile\Client\Hemera Binary\Extern\include\boost/iterator/iterator_traits.hpp(3): error C2228: left of '.Ok' must have class/struct/union
2> type is 'unknown-type'
2>D:\Zeus Project\Hemera Source + Client + Serverfile\Client\Hemera Binary\Extern\include\boost/iterator/iterator_traits.hpp(5): error C2143: syntax error : missing ';' before '&'
2>D:\Zeus Project\Hemera Source + Client + Serverfile\Client\Hemera Binary\Extern\include\boost/iterator/iterator_traits.hpp(5): error C4430: missing type specifier - int assumed. Note: C++ does not support default-int
2>D:\Zeus Project\Hemera Source + Client + Serverfile\Client\Hemera Binary\Extern\include\boost/iterator/iterator_traits.hpp(5): error C2065: 'm_printData' : undeclared identifier
2>D:\Zeus Project\Hemera Source + Client + Serverfile\Client\Hemera Binary\Extern\include\boost/iterator/iterator_traits.hpp(6): error C4430: missing type specifier - int assumed. Note: C++ does not support default-int
2>D:\Zeus Project\Hemera Source + Client + Serverfile\Client\Hemera Binary\Extern\include\boost/iterator/iterator_traits.hpp(6): error C2143: syntax error : missing ',' before '&'
2>D:\Zeus Project\Hemera Source + Client + Serverfile\Client\Hemera Binary\Extern\include\boost/iterator/iterator_traits.hpp(6): error C2065: 'm_printData' : undeclared identifier
2>D:\Zeus Project\Hemera Source + Client + Serverfile\Client\Hemera Binary\Extern\include\boost/iterator/iterator_traits.hpp(6): error C2065: 'printData' : undeclared identifier
2>D:\Zeus Project\Hemera Source + Client + Serverfile\Client\Hemera Binary\Extern\include\boost/iterator/iterator_traits.hpp(8): error C4430: missing type specifier - int assumed. Note: C++ does not support default-int
2>D:\Zeus Project\Hemera Source + Client + Serverfile\Client\Hemera Binary\Extern\include\boost/iterator/iterator_traits.hpp(8): error C2143: syntax error : missing ',' before '&'
2>D:\Zeus Project\Hemera Source + Client + Serverfile\Client\Hemera Binary\Extern\include\boost/iterator/iterator_traits.hpp(8): error C2801: 'operator =' must be a non-static member
2>D:\Zeus Project\Hemera Source + Client + Serverfile\Client\Hemera Binary\Extern\include\boost/iterator/iterator_traits.hpp(9): error C4430: missing type specifier - int assumed. Note: C++ does not support default-int
2>D:\Zeus Project\Hemera Source + Client + Serverfile\Client\Hemera Binary\Extern\include\boost/iterator/iterator_traits.hpp(9): error C2143: syntax error : missing ',' before '&'
2>D:\Zeus Project\Hemera Source + Client + Serverfile\Client\Hemera Binary\Extern\include\boost/iterator/iterator_traits.hpp(11): error C2059: syntax error : 'private'
2>D:\Zeus Project\Hemera Source + Client + Serverfile\Client\Hemera Binary\Extern\include\boost/iterator/iterator_traits.hpp(28): error C2146: syntax error : missing ';' before identifier 'm_printData'
2>D:\Zeus Project\Hemera Source + Client + Serverfile\Client\Hemera Binary\Extern\include\boost/iterator/iterator_traits.hpp(28): error C4430: missing type specifier - int assumed. Note: C++ does not support default-int
2>D:\Zeus Project\Hemera Source + Client + Serverfile\Client\Hemera Binary\Extern\include\boost/iterator/iterator_traits.hpp(28): error C2086: 'int wxPrintData' : redefinition
2> D:\Zeus Project\Hemera Source + Client + Serverfile\Client\Hemera Binary\Extern\include\boost/iterator/iterator_traits.hpp(5) : see declaration of 'wxPrintData'
2>D:\Zeus Project\Hemera Source + Client + Serverfile\Client\Hemera Binary\Extern\include\boost/iterator/iterator_traits.hpp(30): error C2059: syntax error : 'private'
2>D:\Zeus Project\Hemera Source + Client + Serverfile\Client\Hemera Binary\Extern\include\boost/iterator/iterator_traits.hpp(31): error C2065: 'wxPrintDialogData' : undeclared identifier
2>D:\Zeus Project\Hemera Source + Client + Serverfile\Client\Hemera Binary\Extern\include\boost/iterator/iterator_traits.hpp(32): error C4430: missing type specifier - int assumed. Note: C++ does not support default-int
2>D:\Zeus Project\Hemera Source + Client + Serverfile\Client\Hemera Binary\Extern\include\boost/iterator/iterator_traits.hpp(32): error C2143: syntax error : missing ';' before '}'
2>D:\Zeus Project\Hemera Source + Client + Serverfile\Client\Hemera Binary\Extern\include\boost/iterator/iterator_traits.hpp(32): error C2059: syntax error : '}'
2>D:\Zeus Project\Hemera Source + Client + Serverfile\Client\Hemera Binary\Extern\include\boost/iterator/iterator_traits.hpp(41): error C2079: 'wxPageSetupDialogData' uses undefined class 'WXDLLEXPORT'
2>D:\Zeus Project\Hemera Source + Client + Serverfile\Client\Hemera Binary\Extern\include\boost/iterator/iterator_traits.hpp(41): error C2143: syntax error : missing ';' before ':'
2>D:\Zeus Project\Hemera Source + Client + Serverfile\Client\Hemera Binary\Extern\include\boost/iterator/iterator_traits.hpp(41): error C2059: syntax error : ':'
2>D:\Zeus Project\Hemera Source + Client + Serverfile\Client\Hemera Binary\Extern\include\boost/iterator/iterator_traits.hpp(41): error C2059: syntax error : 'public'
2>D:\Zeus Project\Hemera Source + Client + Serverfile\Client\Hemera Binary\Extern\include\boost/iterator/iterator_traits.hpp(42): error C2143: syntax error : missing ';' before '{'
2>D:\Zeus Project\Hemera Source + Client + Serverfile\Client\Hemera Binary\Extern\include\boost/iterator/iterator_traits.hpp(42): error C2447: '{' : missing function header (old-style formal list?)
2>D:\Zeus Project\Hemera Source + Client + Serverfile\Client\Hemera Binary\Extern\include\boost/iterator/iterator_facade.hpp(715): fatal error C1083: Cannot open include file: 'wx-2.8.10/defs.h': No such file or directory
Aceste erori mi le da...
HEMERA - READY TO GO [FULL]
- exo.
-

- Mesaje: 1038
- Membru din: 29 Ian 2017, 12:38
- Aprecieri: 289
- Mulţumiri: 1314
- Discord: Copiază ID
seteaza externul in locatia corectaAlinAlin9 scrie: ↑27 Mai 2021, 13:17exo. scrie: ↑27 Mai 2021, 12:07ce eroare ai, care e problema, ca poate nu e de la visual studio....AlinAlin9 scrie: ↑27 Mai 2021, 00:11
Folosesc acest VS 2013 : altele/2013-update-t83910.html
Am inteles ca este unul din cele mai bune, daca crezi ca ma poti ajuta cu un alt VS 2013, as fi recunoscator.
Seara faina !
Aceste erori mi le da...
- Mega
-

- Mesaje: 107
- Membru din: 17 Dec 2017, 10:30
- Aprecieri: 710
- Mulţumiri: 377
- Discord: Copiază ID
16> UserInterface.vcxproj -> D:\Hemera Source + Client + Serverfile\Sursa\Hemera Binary\projects\UserInterface\..\..\release\Hemera.exe
========== Build: 16 succeeded, 0 failed, 0 up-to-date, 0 skipped ==========
Se compileaza perfect
- qweqe222er
-

- Mesaje: 5
- Membru din: 02 Mai 2021, 15:48
- Server: casa
- Regat: Chunjo
- Aprecieri: 0
- Mulţumiri: 0
- Discord: Copiază ID
Eroare compilare sursa client
- Mega
-

- Mesaje: 107
- Membru din: 17 Dec 2017, 10:30
- Aprecieri: 710
- Mulţumiri: 377
- Discord: Copiază ID
16> UserInterface.vcxproj -> D:\Hemera Source + Client + Serverfile\Sursa\Hemera Binary\projects\UserInterface\..\..\release\Hemera.exe
========== Build: 16 succeeded, 0 failed, 0 up-to-date, 0 skipped ==========
- skristy96
-

- Mesaje: 559
- Membru din: 29 Noi 2013, 21:38
- Server: OficialMT2
- Regat: Jinno
- Aprecieri: 364
- Mulţumiri: 50
- Rezolvări prob.: 1
- Discord: Copiază ID
- Contact:
Mai are careva problema asta cu navicat-ul ?
- Alichen
-

- Mesaje: 137
- Membru din: 04 Noi 2016, 10:08
- Server: OLDFUN2
- Regat: Chunjo
- Aprecieri: 238
- Mulţumiri: 231
- Discord: Copiază ID
-atentie RULEAZA PE MYSQL5.6 - iti zice clar charmeine mysql5.6
Bagă comanda asta să vezi ce mysql5.5 ai tu, versiunea.
Cod: Selectaţi tot
pkg info -r mysql55-clientCod: Selectaţi tot
pkg delete -f VERSIUENATAMYSQLCod: Selectaţi tot
pkg install -f mysql56-serverCod: Selectaţi tot
make install clear- Marius Dragomir
-

- Mesaje: 1020
- Membru din: 13 Noi 2017, 21:32
- Server: HellHound
- Regat: Jinno
- Aprecieri: 499
- Mulţumiri: 1211
- Discord: Copiază ID
Vreo idee de ce nu porneste mysql? Am facut upgrade la mysql dar totusi nu vrea sa porneasca si aparent dau de o eroare ciudata
Folosesc freebsd 11.3 gata de compilare de la gazduire, deci o solutie ce ar trebuii sa ii fac? 
- Pentru acest mesaj, Marius Dragomir a primit 4 (de) mulţumiri
- savroz • ranos2 • CRiQ • heronys
-
- Informaţie
-
Cine este conectat
Utilizatori ce ce navighează pe acest forum: Niciun utilizator înregistrat și 7 vizitatori




