Problema Compilare

Totalitatea subiectelor care nu respectă regulamentul impus in sectiunea "Probleme şi Întrebări" vor fi stocate aici.
Închis
Avatar utilizator
bLoNdu1
Nou Venit

Nou Venit
Mesaje: 8
Membru din: 13 Dec 2018, 20:22
Aprecieri: 36  
Mulţumiri: 0
Medalii

*Problemă/Întrebare: Nu se compileaza
Tipologie server: PVM
*Resursă folosită: -
*ServerFiles utilizat: Argo
*Syserr: -
Poză:
*Detalii suplimentare:

Toate bune mai putin ...

Cod: Selectaţi tot

root@metin2:/usr/src/argo/Server/db/src # gmake dep
makedepend -fDepend  -I../../boost -I../../libmysql/5.x-5.1.35 -I/usr/include/c++/3.3 -I/usr/include/c++/4.2 -p.obj/ Config.cpp NetBase.cpp Peer.cpp PeerBase.cpp Main.cpp Lock.cpp DBManager.cpp Cache.cpp LoginData.cpp ClientManager.cpp ClientManagerPlayer.cpp ClientManagerLogin.cpp ClientManagerBoot.cpp ClientManagerParty.cpp ClientManagerGuild.cpp GuildManager.cpp HB.cpp PrivManager.cpp MoneyLog.cpp ItemAwardManager.cpp ClientManagerEventFlag.cpp Marriage.cpp Monarch.cpp BlockCountry.cpp ItemIDRangeManager.cpp ClientManagerHorseName.cpp version.cpp AuctionManager.cpp ProtoReader.cpp CsvReader.cpp  2> /dev/null
root@metin2:/usr/src/argo/Server/db/src # gmake clean
root@metin2:/usr/src/argo/Server/db/src # gmake -j4
compile Config.cpp
compile NetBase.cpp
compile Peer.cpp
gmake: g++: Command not found
compile PeerBase.cpp
gmake: *** [Makefile:58: .obj/Config.o] Error 127
gmake: *** Waiting for unfinished jobs....
gmake: g++: Command not found
gmake: *** [Makefile:58: .obj/PeerBase.o] Error 127
gmake: g++: Command not found
gmake: *** [Makefile:58: .obj/Peer.o] Error 127
gmake: g++: Command not found
gmake: *** [Makefile:58: .obj/NetBase.o] Error 127
root@metin2:/usr/src/argo/Server/db/src #
root@metin2:/usr/src/argo/Server/db/src #
root@metin2:/usr/src/argo/Server/db/src # compile Config.cpp
compile: Command not found.
root@metin2:/usr/src/argo/Server/db/src # compile NetBase.cpp
compile: Command not found.
root@metin2:/usr/src/argo/Server/db/src # compile Peer.cpp
compile: Command not found.
root@metin2:/usr/src/argo/Server/db/src # gmake: g++: Command not found
gmake:: Too many arguments.
root@metin2:/usr/src/argo/Server/db/src # compile PeerBase.cpp
compile: Command not found.
root@metin2:/usr/src/argo/Server/db/src # gmake: *** [Makefile:58: .obj/Config.o] Error 127
gmake:: Too many arguments.
root@metin2:/usr/src/argo/Server/db/src # gmake: *** Waiting for unfinished jobs....
Avatar utilizator
Wizzard
Utilizator neserios / Untrustworthy user !

Utilizator neserios / Untrustworthy user !
Mesaje: 901
Membru din: 05 Iul 2021, 13:37
Server: 911.Projects
Regat: Chunjo
Aprecieri: 525  
Mulţumiri: 3420  
Discord: Copiază ID
 Contact:
Medalii

ai modificat ceva sau ai adaugat ceva?
Pentru acest mesaj, Wizzard for the post:
bLoNdu1
Avatar utilizator
CRiQ
Nivel 3

Nivel 3
Mesaje: 375
Membru din: 03 Ian 2019, 12:55
Server: BOMBĂ
Regat: Shinsoo
Aprecieri: 217  
Mulţumiri: 465  
Discord: Copiază ID
Medalii

Tare greu sa dai un search pe forum.
pkg install gcc49
Dupa ce instalezi gcc49 modifici in makefile din g++ in gcc49
Pentru acest mesaj, CRiQ for the post:
bLoNdu1


Afișează semnătura
Avatar utilizator
bLoNdu1
Nou Venit

Nou Venit
Mesaje: 8
Membru din: 13 Dec 2018, 20:22
Aprecieri: 36  
Mulţumiri: 0
Medalii

Veteleanu000 Am cautat, nu este solutia corecta pentru problema mea, esti mult prea ofensiv man, vei primi reactii negative :) (parerea mea)
KyoTo Man, cred ca da si daca nu ma insel char.cpp... dar era doar un drop, de la asta sa fie ?
Avatar utilizator
Wizzard
Utilizator neserios / Untrustworthy user !

Utilizator neserios / Untrustworthy user !
Mesaje: 901
Membru din: 05 Iul 2021, 13:37
Server: 911.Projects
Regat: Chunjo
Aprecieri: 525  
Mulţumiri: 3420  
Discord: Copiază ID
 Contact:
Medalii

bLoNdu1 scrie: ↑20 Iul 2021, 22:23 @Veteleanu000 Am cautat, nu este solutia corecta pentru problema mea, esti mult prea ofensiv man, vei primi reactii negative :) (parerea mea)
@KyoTo Man, cred ca da si daca nu ma insel char.cpp... dar era doar un drop, de la asta sa fie ?
incearca sa scoti ce ai modificat si compileaza sa vezi daca este din cauza acelui drop.
Avatar utilizator
bLoNdu1
Nou Venit

Nou Venit
Mesaje: 8
Membru din: 13 Dec 2018, 20:22
Aprecieri: 36  
Mulţumiri: 0
Medalii

Am incercat, aceasi chestie.

Alte idei, cineva ?
Avatar utilizator
Dex
Nivel 3

Nivel 3
Mesaje: 397
Membru din: 07 Mai 2020, 14:32
Regat: Shinsoo
Aprecieri: 137  
Mulţumiri: 486  
Discord: Copiază ID
Medalii

bLoNdu1 scrie: ↑21 Iul 2021, 10:42 Am incercat, aceasi chestie.

Alte idei, cineva ?
Posteaza-ne si noua Makefille din db/src sa vedem ce gcc folosesti, cum ai compilat pana acum? Ce modificare ai facut?
Pentru acest mesaj, Dex for the post:
bLoNdu1
Imagine
Afișează semnătura
Avatar utilizator
Syron
Developer

Developer
Mesaje: 712
Membru din: 14 Mai 2014, 23:41
Aprecieri: 5  
Mulţumiri: 138  
Medalii

Cod: Selectaţi tot

gmake: g++: Command not found
Nu ai compiler instalat sau definit (etc/make.conf)
Închis

Înapoi la “Arhivă Probleme şi Întrebări”

  • Informaţie
  • Cine este conectat

    Utilizatori ce ce navighează pe acest forum: Bing [Bot], Semrush [Bot] și 51 vizitatori